program: Gaussian 09
title: 000285694
version: EM64L-G09RevD.01
frameworkgroup: C1[X(C17H26N6O)]
method: RPBEPBE
basis: SDD
operation: Freq
keyword: #p
keyword: freq=noraman
keyword: PBEPBE/SDD
title: #p freq=noraman PBEPBE/SDD
converged: YES YES NO NO
title: Mulliken charges:
elementType: O N N N N N N C C C C C C C C C C C C C C C C C H H H H H H H H H H H H H H H H H H H H H H H H H H
charge: -0.292298 -0.306838 -0.098032 -0.119318 -0.175807 -0.633610 -0.614543 0.189119 0.314297 -0.686106 -0.706003 0.229515 0.514727 -0.352711 -0.336646 -0.677434 -0.451233 -0.390717 -0.025743 0.221328 -0.370927 -0.333680 -0.644481 -0.666363 0.234596 0.232625 0.210751 0.240575 0.202790 0.227145 0.258359 0.257918 0.263970 0.220437 0.234767 0.264133 0.231438 0.217649 0.257552 0.199985 0.333228 0.342049 0.212585 0.245151 0.216825 0.204398 0.252633 0.217759 0.314741 0.319442
chargesum: 0.00000
title: Mulliken charges with hydrogens summed into heavy atoms:
elementType: O N N N N N N C C C C C C C C C C C C C C C C C
charge: -0.292298 -0.306838 -0.098032 -0.119318 -0.175807 0.041667 0.019640 0.189119 0.314297 -0.008133 -0.035492 0.229515 0.514727 -0.094352 -0.078727 -0.193028 -0.216466 -0.126584 -0.025743 0.221328 0.078159 0.123858 0.030080 0.008427
polarizability: 3.33766020e+02 1.39368619e+01 2.05865766e+02 -5.18941208e+00 -4.67665330e+00 1.77050216e+02
1716.lowfreq: -3.7496 -0.0007 -0.0006 0.0002 2.6184 12.7218 17.8355 23.8033 25.0451
frequency: 17.6821 23.7020 24.4995 39.9472 50.2418 56.4331 63.2927 90.9108 98.6962 106.4433 126.6671 142.1168 170.3390 191.4868 206.2839 209.1398 211.5797 232.3390 249.3854 263.1492 299.7668 306.5512 313.3760 321.0968 334.1504 356.4827 364.2089 368.7208 389.5648 410.0405 414.4538 430.3602 448.6582 484.6952 489.2977 493.0479 514.6413 518.5789 526.8359 536.4898 559.4616 564.2641 601.0164 636.3818 643.2130 671.8618 691.2723 708.9188 725.6668 756.6189 777.6447 783.7872 803.3538 814.7431 845.4863 857.0087 869.1620 906.6796 910.0145 932.4502 937.5570 948.0878 950.7843 969.8162 985.5931 990.2696 1011.9403 1026.0752 1051.8986 1068.4618 1080.5621 1098.9077 1103.1256 1104.5630 1119.5220 1128.8077 1130.2424 1182.4762 1187.6188 1190.8642 1205.9656 1212.3444 1241.2756 1265.1351 1273.1568 1283.1773 1299.3152 1303.0802 1337.2687 1354.6975 1362.1858 1366.3325 1384.0151 1385.2441 1390.2457 1403.1645 1405.9683 1418.4920 1449.3498 1449.7937 1453.6178 1459.0605 1465.1743 1467.3698 1469.0867 1471.0941 1475.2420 1477.8731 1482.9627 1489.8788 1499.2534 1530.0628 1565.6935 1568.7523 1580.4622 1602.6433 1613.3744 1616.6706 2980.6682 2983.7639 2985.7742 2988.9130 2994.5582 3006.4783 3015.0825 3061.8703 3069.0439 3070.5141 3080.9529 3085.1373 3087.3248 3092.1856 3095.8836 3101.4285 3103.4287 3108.7297 3118.0676 3127.6982 3151.4986 3157.2549 3553.3444 3567.9164 3708.6496 3730.5668
redmass: 4.2014 4.1778 4.1600 4.0161 4.0349 3.6428 3.0084 5.1369 3.8141 3.5044 3.9001 2.5488 4.0217 5.3315 1.2495 1.1691 1.3122 2.5394 2.8600 1.0295 2.7161 2.6014 2.9701 2.7130 3.4654 2.7262 3.0744 1.2667 1.2083 2.3971 2.8032 3.3412 2.7926 2.8079 3.0201 2.4862 1.7519 2.4188 1.5928 2.4614 3.4215 3.5571 3.9631 6.6815 4.7009 7.6610 4.1716 3.5635 10.6234 3.7268 1.1743 1.2623 2.5087 3.6082 2.2065 1.3400 2.5246 2.5262 1.5868 2.9243 2.7064 1.9121 1.8908 1.4548 1.3634 1.3235 2.7555 2.6480 3.5752 2.1048 1.8425 1.7304 1.4385 1.9404 2.2287 1.4999 2.0392 1.1624 1.5835 3.3135 2.4732 2.5309 4.1685 1.4278 4.2649 1.4221 1.3282 1.4539 1.2639 1.2906 4.1846 1.2370 1.2544 1.2223 1.2218 4.0300 3.0153 2.6872 1.3600 2.0717 1.1112 1.1122 1.1111 1.0524 1.0658 1.0463 1.0727 1.0802 1.0564 1.1292 2.4259 2.5487 5.6608 1.8506 5.7338 2.4690 2.8892 3.2545 1.0345 1.0384 1.0577 1.0436 1.0356 1.0600 1.0613 1.1010 1.0999 1.0958 1.1002 1.0993 1.0965 1.0999 1.0999 1.1013 1.1019 1.0993 1.0893 1.0891 1.0956 1.0962 1.0443 1.0436 1.1053 1.1058
irintensity: 1.3786 2.3847 0.0350 0.2471 0.1521 0.0521 1.0956 1.8690 2.7808 2.0740 0.1126 0.9905 0.4123 5.6938 0.1933 0.1057 0.9320 1.7902 0.1542 0.4237 5.4267 5.9788 1.9506 1.1170 6.3479 33.3932 5.1277 182.8112 184.8510 2.6971 4.3529 18.0095 8.1086 13.0714 4.8246 40.1634 9.9551 3.1114 38.1875 16.7517 2.6817 29.6810 5.9993 0.9335 2.1613 3.6999 3.9718 14.7637 32.3035 4.1123 4.0631 40.5439 9.9440 42.0662 13.5047 5.7586 0.3446 5.9817 1.8147 2.9967 7.4433 0.3204 7.9137 0.2587 0.4225 1.8615 10.1570 4.1203 8.9747 19.9179 6.1530 21.1923 5.4276 3.8151 1.9825 40.8498 43.8094 0.9780 3.0686 31.5719 2.8122 32.1584 23.4297 62.0359 104.4372 3.3620 25.7455 17.8205 5.0745 5.5643 1.4235 31.9697 17.3097 33.2704 3.8175 380.7234 19.9650 103.0863 46.8010 82.3761 21.4316 10.7986 9.6115 9.1336 6.3533 19.6953 35.5636 12.7181 7.9701 44.2058 80.8823 277.7892 36.1357 210.5751 193.1996 628.1834 131.3932 400.8937 15.9786 15.1222 56.3829 22.7187 21.2396 21.3476 28.9135 8.3004 12.8612 1.1469 25.6751 41.3067 29.6877 13.2596 42.6018 19.6857 49.7307 29.3646 16.7304 5.9643 8.3182 2.9980 55.8161 85.0422 57.9197 36.5556
temp: 298.150 k
press: 1.00000 atm
elementType: 8 7 7 7 7 7 7 6 6 6 6 6 6 6 6 6 6 6 6 6 6 6 6 6 1 1 1 1 1 1 1 1 1 1 1 1 1 1 1 1 1 1 1 1 1 1 1 1 1 1
symmnumber: 1
zpe: 1096537.4 jmol-1
zpe.correction: 0.417649 hartree
zpe.thermalcorrener: 0.443264 hartree
zpe.thermalcorrenthalpy: 0.444208 hartree
zpe.thermalcorrgfe: 0.360644 hartree
zpe.sumelectzpe: -1065.351668 hartree
zpe.sumelectthermal: -1065.326053 hartree
zpe.sumelectthermalent: -1065.325109 hartree
zpe.sumelectthermalfe: -1065.408673 hartree
dipole: -2.0013 0.4992 -2.6612
dipole: 3.3670
quadrupole: -149.3151 -140.0509 -142.1466
quadrupole: -19.3164 8.9731 4.5095
quadrupole: -5.4776 3.7867 1.6909 -19.3164 8.9731 4.5095
hfenergy: -1065.7693171 hartree
pointgroup: C01 [X(C17H26N6O1)]
dipole: 0.8912044 0.6957611 -0.6902221 debye
polarizability: 327.7733231|1.7009107|183.4553488|31.3084726|13.130285|205.4533299 unknown
InChI: InChI=1S/C17H26N6O/c1-5-22(6-2)14(24)11-12-7-9-13(10-8-12)23-16(19)20-15(18)21-17(23,3)4/h7-10H,5-6,11,18-19H2,1-4H3
charge 0 multiplicity 1
50 atoms
O  4.493818 0.034632 2.691319
N  -2.269955 0.221408 -0.00012
N  -3.877992 -0.723299 -1.636973
N  4.598125 -0.174547 0.380142
N  -4.633552 0.54234 0.328444
N  -3.11608 1.536604 1.791139
N  -6.107301 -0.041463 -1.381237
C  -2.563053 -0.916255 -1.00932
C  -0.919393 0.577015 0.358223
C  -2.540867 -2.26778 -0.240904
C  -1.494778 -0.901179 -2.119506
C  -3.358698 0.740953 0.689288
C  1.766304 1.281666 1.035292
C  -0.270857 1.653201 -0.297895
C  -0.218833 -0.133972 1.369467
C  3.19723 1.658274 1.410579
C  1.056682 1.996203 0.037318
C  1.106511 0.216211 1.702256
C  -4.806913 -0.111541 -0.910892
C  4.146775 0.448978 1.535851
C  4.230035 0.202683 -1.00328
C  5.545146 -1.309354 0.537022
C  3.194229 -0.747777 -1.646495
C  7.013724 -0.839674 0.6051
H  -2.810189 -3.080635 -0.937525
H  -3.28422 -2.25404 0.576122
H  -1.539733 -2.479835 0.177419
H  -1.756594 -1.688846 -2.844864
H  -0.480636 -1.095281 -1.72756
H  -1.50627 0.066258 -2.64934
H  -0.816863 2.207591 -1.068333
H  -0.720393 -0.956889 1.890422
H  3.211042 2.117593 2.415365
H  3.589801 2.412689 0.70446
H  1.544111 2.831374 -0.481183
H  1.64034 -0.338512 2.483149
H  3.837821 1.232286 -1.010266
H  5.156119 0.210973 -1.612139
H  5.283489 -1.838601 1.468615
H  5.395426 -2.001226 -0.311932
H  -3.925268 1.966484 2.231432
H  -2.181143 1.669857 2.166472
H  3.563354 -1.788888 -1.669534
H  2.244067 -0.728971 -1.086175
H  2.990371 -0.437706 -2.687969
H  7.301307 -0.272592 -0.299584
H  7.163911 -0.195548 1.487927
H  7.690854 -1.70922 0.69233
H  -6.340488 -0.489498 -2.262197
H  -6.786823 0.504755 -0.861134
