program: Gaussian 09
title: 000285647
version: EM64L-G09RevD.01
frameworkgroup: C1[X(C14H15NO4)]
method: RPBEPBE
basis: SDD
operation: Freq
keyword: #p
keyword: freq=noraman
keyword: PBEPBE/SDD
title: #p freq=noraman PBEPBE/SDD
converged: YES YES NO NO
title: Mulliken charges:
elementType: O O O O N C C C C C C C C C C C C C C H H H H H H H H H H H H H H H
charge: -0.261384 -0.425066 -0.227900 -0.259027 -0.177901 -0.369272 0.392982 0.183847 -0.173001 -0.354672 0.283464 -0.417632 0.106486 0.251790 -0.217333 -0.369138 -0.810973 -0.261741 -0.656041 0.308253 0.249099 0.188166 0.259141 0.230440 0.253650 0.272955 0.242340 0.246806 0.223195 0.235010 0.353568 0.213987 0.254805 0.231097
chargesum: 0.00000
title: Mulliken charges with hydrogens summed into heavy atoms:
elementType: O O O O N C C C C C C C C C C C C C C
charge: -0.261384 -0.071497 -0.227900 -0.259027 -0.177901 -0.061019 0.392982 0.183847 0.076098 -0.166506 0.283464 -0.158491 0.106486 0.251790 0.013107 -0.115488 -0.048872 0.196465 0.043847
polarizability: 2.25330146e+02 2.77051686e+01 1.89343254e+02 1.48984110e+01 -2.61614590e+01 1.19603385e+02
1716.lowfreq: -10.4681 -4.3791 -3.0729 -0.0010 -0.0009 -0.0006 15.2589 29.0908 49.6378
frequency: 12.5249 28.7590 49.6325 61.2208 71.7718 94.1623 114.1122 128.7373 160.4674 179.0335 193.0002 220.4134 241.1730 259.3018 278.0393 285.0486 314.6780 328.6513 351.2713 421.8842 448.3643 457.6983 488.3400 508.7471 553.6373 559.9554 561.6239 572.1665 589.0797 628.8277 678.5979 693.3476 712.5302 743.2377 761.4134 784.1368 810.6857 817.6100 829.3473 881.3254 895.9228 901.8612 905.2577 964.7350 967.6474 998.4440 1013.7763 1034.0712 1057.3188 1076.9322 1096.7357 1127.6917 1136.1283 1156.9177 1158.8489 1177.0695 1216.0734 1225.0358 1265.4676 1275.6881 1290.8340 1294.3005 1327.9721 1339.3332 1352.7420 1380.8689 1384.4221 1391.9937 1425.3211 1454.6166 1457.3503 1461.9811 1462.3109 1471.3239 1481.2672 1483.3642 1577.6493 1595.7071 1620.0029 1642.6397 1647.6891 2990.4039 2994.5637 3030.8162 3051.3641 3077.2873 3090.2538 3095.8391 3121.7874 3130.7066 3133.4727 3142.4426 3161.6350 3177.5255 3199.1205 3592.8127
redmass: 3.7794 3.4824 4.7521 4.1171 4.9864 4.9354 4.7136 3.1592 2.7733 1.2901 1.5354 3.2752 3.0041 3.1562 3.5743 1.6581 3.9159 3.9544 4.6005 3.5417 4.9506 3.5838 6.2181 4.1149 5.2696 4.5319 5.4379 3.3531 4.8658 5.1381 3.6132 4.5696 2.2168 2.7459 2.2109 1.6982 1.5040 4.0009 4.4283 2.7581 3.4620 1.5281 1.6705 2.4822 1.3724 2.4487 3.1723 1.6652 2.1338 2.5277 2.1833 2.1263 2.1147 1.6759 1.5920 1.3911 1.5696 2.2124 1.6337 1.1222 3.4071 1.8202 3.1202 1.4724 1.2897 1.4492 2.9402 1.2283 2.1869 1.2003 1.0937 1.0815 2.2516 1.0518 3.0925 1.0584 7.2402 7.4321 6.9917 7.7746 7.9774 1.0387 1.0363 1.0594 1.0838 1.0977 1.0973 1.1035 1.1059 1.0889 1.0981 1.0868 1.0932 1.0984 1.0952 1.0654
irintensity: 1.3900 0.8565 0.2368 1.0255 1.7459 3.9537 0.6008 2.8715 1.2593 4.0170 4.6754 0.7876 4.7486 23.2841 4.0287 94.3380 0.9594 20.4135 13.9229 1.2207 14.3308 0.4694 1.7846 3.1719 5.3473 0.8118 24.6003 4.5710 1.8147 13.2947 30.8617 27.9495 4.2304 34.3902 53.6770 26.6512 5.5057 13.5220 0.8954 10.1037 21.1953 10.4525 3.9177 1.1002 1.8530 70.2284 64.2261 8.1711 36.0445 13.0150 35.5322 454.8227 72.2025 16.9320 6.0955 1.2599 142.8905 17.4302 22.9749 4.9428 155.7635 5.9583 114.8179 82.5632 2.3594 25.7800 74.7668 26.4132 1.2327 5.0870 10.2008 18.5741 129.8709 20.1135 16.3609 13.6702 256.5600 127.6194 18.3727 91.4313 46.9893 5.6931 19.2284 26.5582 1.2598 11.2192 32.3110 0.4309 27.7315 12.7287 7.0065 4.4438 7.7128 13.7306 7.2100 23.5684
temp: 298.150 k
press: 1.00000 atm
elementType: 8 8 8 8 7 6 6 6 6 6 6 6 6 6 6 6 6 6 6 1 1 1 1 1 1 1 1 1 1 1 1 1 1 1
symmnumber: 1
zpe: 694192.4 jmol-1
zpe.correction: 0.264404 hartree
zpe.thermalcorrener: 0.282853 hartree
zpe.thermalcorrenthalpy: 0.283797 hartree
zpe.thermalcorrgfe: 0.215862 hartree
zpe.sumelectzpe: -896.756232 hartree
zpe.sumelectthermal: -896.737783 hartree
zpe.sumelectthermalent: -896.736839 hartree
zpe.sumelectthermalfe: -896.804774 hartree
dipole: -0.5422 0.7251 -0.8920
dipole: 1.2710
quadrupole: -117.7812 -86.9647 -115.2380
quadrupole: -8.3877 -2.2385 -6.6010
quadrupole: -11.1199 19.6966 -8.5767 -8.3877 -2.2385 -6.6010
hfenergy: -897.0206359 hartree
pointgroup: C01 [X(C14H15N1O4)]
dipole: 0.176611 -0.3156039 -0.3453261 debye
polarizability: 229.0754531|24.3319841|186.5725299|-16.7033153|24.265994|118.6288022 unknown
InChI: InChI=1S/C14H15NO4/c1-3-19-14(18)13-11-5-4-6-12(17)10(11)7-8-15(13)9(2)16/h4-8,13,17H,3H2,1-2H3
charge 0 multiplicity 1
34 atoms
O  -1.494593 2.09785 0.085414
O  4.224052 -0.739962 -1.055742
O  -1.824323 0.398849 -1.483669
O  -2.731814 -1.262101 1.462017
N  -0.729172 -1.467015 0.31145
C  -0.491688 -0.028573 0.587503
C  0.987623 0.357952 0.515526
C  1.887735 -0.442287 -0.250265
C  0.150038 -2.162257 -0.538817
C  1.391209 -1.679948 -0.851331
C  -1.346795 0.810119 -0.405603
C  1.432123 1.52732 1.162175
C  3.247642 -0.018842 -0.346328
C  -1.944349 -1.998409 0.79692
C  2.7834 1.930565 1.04059
C  3.691424 1.16222 0.285101
C  -2.250085 -3.456354 0.491036
C  -2.310475 3.043581 -0.744971
C  -3.796791 2.895241 -0.411678
H  -0.894642 0.193568 1.590113
H  -0.216016 -3.106359 -0.943616
H  1.994224 -2.265609 -1.553778
H  0.721695 2.133208 1.73264
H  3.128867 2.843709 1.536039
H  4.741921 1.448789 0.181764
H  -3.159723 -3.729066 1.045115
H  -1.427765 -4.12986 0.790985
H  -2.44322 -3.604939 -0.58796
H  -1.915609 4.034407 -0.469824
H  -2.109533 2.833595 -1.810115
H  3.863267 -1.588741 -1.411199
H  -4.380753 3.646531 -0.975308
H  -4.162001 1.892759 -0.689609
H  -3.976672 3.051857 0.665527
