program: Gaussian 09
title: 000285637
version: EM64L-G09RevD.01
frameworkgroup: C1[X(C11H13NO2)]
method: RPBEPBE
basis: SDD
operation: Freq
keyword: #p
keyword: freq=noraman
keyword: PBEPBE/SDD
title: #p freq=noraman PBEPBE/SDD
converged: YES YES NO NO
title: Mulliken charges:
elementType: O O N C C C C C C C C C C C H H H H H H H H H H H H H
charge: -0.426286 -0.288672 -0.118112 -0.529884 -0.430348 -0.511690 0.132166 0.315661 0.127500 -0.398484 0.223840 -0.369095 -0.211438 -0.794923 0.258610 0.207948 0.278218 0.228018 0.236794 0.252306 0.229627 0.253647 0.229985 0.237027 0.236765 0.270142 0.360677
chargesum: 0.00000
title: Mulliken charges with hydrogens summed into heavy atoms:
elementType: O O N C C C C C C C C C C C
charge: -0.065609 -0.288672 -0.118112 -0.063325 0.075888 -0.022590 0.132166 0.315661 0.127500 -0.168857 0.223840 -0.115447 0.018547 -0.050990
polarizability: 1.66022728e+02 4.93740151e+00 1.40267794e+02 -1.11659407e+00 3.25059564e+00 7.68000902e+01
1716.lowfreq: -6.9506 -0.0007 -0.0005 -0.0002 5.5158 9.4724 33.4066 72.1958 100.4190
frequency: 33.2842 72.1430 100.4129 139.8250 183.0162 205.7724 230.7027 261.0423 272.6549 318.5547 333.4550 353.0872 412.7825 460.8197 471.1927 497.4675 525.2766 546.5596 569.2065 585.1252 619.0763 658.6169 706.5399 750.7412 779.4718 800.9630 880.0126 897.4394 928.7817 960.9886 970.1244 984.6599 1013.0144 1032.5108 1034.6586 1061.3411 1091.7439 1133.8331 1166.7430 1187.0217 1197.1654 1214.8288 1230.0413 1235.3581 1280.4560 1292.2691 1317.3652 1332.9938 1363.5145 1377.7878 1399.5226 1421.7842 1447.6380 1450.9294 1455.2203 1461.2676 1468.1738 1478.7707 1485.5999 1594.1924 1598.3041 1623.4687 2924.5619 2947.7739 2979.4429 2988.3885 3007.0761 3067.3180 3075.2944 3095.1179 3120.3876 3131.2632 3148.7896 3175.2847 3576.9772
redmass: 5.1169 3.6507 4.0132 3.0761 1.1248 3.4573 2.7613 3.4213 2.9322 1.2393 3.3022 2.9250 3.5165 4.0650 3.2500 4.0617 4.5207 3.7869 3.8856 4.1024 3.7786 4.7162 2.7166 2.7706 1.4479 4.5608 1.3873 2.3840 2.7823 1.6484 1.5018 2.4844 2.1650 1.8042 2.1868 2.1856 1.8600 1.3876 1.2455 2.0143 2.1158 1.5155 1.5097 1.5275 2.2010 2.0980 1.6492 1.4500 1.3609 1.2295 3.8634 3.0643 1.3860 1.3199 1.4489 1.1893 1.1467 1.4512 1.4796 6.4810 6.7862 6.8387 1.0713 1.0604 1.0717 1.0383 1.0949 1.0885 1.0976 1.0959 1.0881 1.0979 1.0922 1.0973 1.0654
irintensity: 2.6705 3.6784 4.3284 0.4476 0.7895 1.7276 1.7463 2.2703 0.9899 133.5299 11.3505 3.7353 0.8552 4.8768 9.6151 6.0093 2.1901 0.1777 3.2761 11.7709 3.6164 14.1758 7.6696 3.1461 57.5181 4.2867 2.2667 11.6622 1.2546 1.3122 3.3089 36.9899 8.0667 11.5794 14.5141 36.7424 7.9452 151.3935 0.9051 29.0779 26.4207 0.3724 137.8525 13.2534 60.3707 4.6221 11.9851 11.9488 7.2663 32.5027 19.5260 157.1294 26.9426 23.9876 54.0634 21.5032 33.2899 10.0979 11.3587 267.3515 63.3103 12.2186 40.3162 36.9799 23.6880 7.9057 44.0016 12.0735 14.0756 3.2279 8.0846 11.1850 18.2080 11.3899 25.9254
temp: 298.150 k
press: 1.00000 atm
elementType: 8 8 7 6 6 6 6 6 6 6 6 6 6 6 1 1 1 1 1 1 1 1 1 1 1 1 1
symmnumber: 1
zpe: 575373.8 jmol-1
zpe.correction: 0.219148 hartree
zpe.thermalcorrener: 0.231850 hartree
zpe.thermalcorrenthalpy: 0.232795 hartree
zpe.thermalcorrgfe: 0.179956 hartree
zpe.sumelectzpe: -631.149836 hartree
zpe.sumelectthermal: -631.137134 hartree
zpe.sumelectthermalent: -631.136190 hartree
zpe.sumelectthermalfe: -631.189029 hartree
dipole: 1.1060 2.2257 1.0153
dipole: 2.6847
quadrupole: -100.5407 -73.6041 -83.7649
quadrupole: -7.8563 -1.4339 -1.5229
quadrupole: -14.5708 12.3658 2.2050 -7.8563 -1.4339 -1.5229
hfenergy: -631.3689842 hartree
pointgroup: C01 [X(C11H13N1O2)]
dipole: 0.4601593 0.8567329 0.4122118 debye
polarizability: 166.1917241|4.4350531|139.8859755|-2.1173935|4.5916331|77.0129128 unknown
InChI: InChI=1S/C11H13NO2/c1-8(13)12-6-5-10-9(7-12)3-2-4-11(10)14/h2-4,14H,5-7H2,1H3
charge 0 multiplicity 1
27 atoms
O  2.860829 -1.989682 -0.598705
O  -3.747374 -1.042123 -0.35941
N  -1.799466 -0.012853 0.38033
C  0.005722 -1.668061 0.080334
C  -1.259652 -1.290695 0.878436
C  -0.916078 1.146019 0.579836
C  0.979666 -0.495483 0.00628
C  0.548231 0.833551 0.255312
C  2.351179 -0.708805 -0.312154
C  1.472148 1.905347 0.210079
C  -3.056216 0.016817 -0.223607
C  3.276975 0.354194 -0.35728
C  2.830204 1.66468 -0.090421
C  -3.569331 1.370391 -0.71618
H  -0.297731 -1.990054 -0.936408
H  0.474146 -2.543977 0.578817
H  -2.050021 -2.049311 0.765492
H  -1.008765 -1.183566 1.952783
H  -0.985588 1.496884 1.633816
H  -1.251956 1.980736 -0.056712
H  1.127546 2.927998 0.40608
H  4.320541 0.137444 -0.602801
H  3.541246 2.49687 -0.126201
H  -2.950904 1.764516 -1.54387
H  -3.590079 2.127503 0.088412
H  -4.59296 1.217996 -1.087873
H  2.145087 -2.672436 -0.57878
