program: Gaussian 09
title: 000285676
version: EM64L-G09RevD.01
frameworkgroup: C1[X(C12H15N5O3)]
method: RPBEPBE
basis: SDD
operation: Freq
keyword: #p
keyword: freq=noraman
keyword: PBEPBE/SDD
title: #p freq=noraman PBEPBE/SDD
converged: YES YES NO NO
title: Mulliken charges:
elementType: O O O N N N N N C C C C C C C C C C C C H H H H H H H H H H H H H H H
charge: -0.258219 -0.460420 -0.443055 -0.220153 -0.084555 -0.056543 -0.061610 -0.610058 -0.157868 -0.058832 -0.493045 -0.497601 -0.247255 -0.171876 -0.070710 0.137409 -0.196159 -0.092156 0.159315 -0.374980 0.252218 0.238138 0.238901 0.239469 0.232972 0.244077 0.252983 0.317382 0.300660 0.364736 0.361475 0.293464 0.243862 0.345109 0.332924
chargesum: 0.00000
title: Mulliken charges with hydrogens summed into heavy atoms:
elementType: O O O N N N N N C C C C C C C C C C C C
charge: -0.258219 -0.095684 -0.081580 -0.220153 -0.084555 -0.056543 -0.061610 0.067976 0.094350 0.179306 -0.014676 -0.020551 0.005727 0.145506 0.229951 0.137409 0.097304 -0.092156 0.159315 -0.131118
polarizability: 2.12905619e+02 4.58318090e+00 1.70771521e+02 1.91369606e+01 -1.27076615e+01 1.23968510e+02
1716.lowfreq: -9.1156 -0.0008 -0.0006 -0.0005 5.6661 9.1299 15.4519 22.3762 44.1479
frequency: 8.4235 21.9766 44.1229 74.3821 95.1278 116.8544 149.3539 181.9307 203.9655 212.2424 237.3296 256.5830 276.7746 282.6980 306.4764 311.9155 335.0307 358.4455 375.0158 456.5909 512.2831 515.4857 529.7977 549.0333 551.8059 557.4199 580.3760 612.7029 643.1385 662.1225 689.2350 705.6376 754.1211 774.2594 790.3403 796.1296 817.2509 848.2146 853.2093 856.0984 862.6274 869.4310 920.4470 928.0327 929.8692 958.9239 966.5663 1000.0928 1011.3938 1024.9277 1032.2886 1044.9173 1067.9013 1079.6534 1104.0090 1141.2999 1153.1016 1163.8098 1172.7813 1188.2470 1206.2182 1213.2474 1224.2449 1249.8071 1255.8387 1276.5285 1288.3714 1294.6667 1298.5818 1308.1559 1317.6370 1353.0396 1362.7762 1364.6846 1377.4868 1387.6388 1411.0388 1430.6021 1446.0363 1457.9623 1473.3683 1532.9633 1578.6588 1631.6029 3022.6348 3030.2114 3038.2961 3072.6047 3097.5862 3104.3638 3113.9647 3162.7545 3195.3880 3213.3920 3254.8591 3446.9814 3539.6057 3581.6495 3694.8442
redmass: 5.2326 5.6032 5.3527 3.2105 5.4188 6.6460 3.1731 6.2138 4.8087 3.2687 4.1010 2.5712 4.9245 2.5261 3.8938 3.9520 6.3225 3.5225 4.6324 2.9369 8.7156 1.2327 1.1321 1.0475 4.3908 3.9526 4.9845 7.4538 4.9490 10.6058 4.4062 7.7056 3.4610 1.3233 5.4119 8.9718 1.3539 3.7022 1.5393 4.7277 2.6936 4.8553 3.1886 2.8844 1.4674 2.7163 2.6856 3.8809 4.1920 3.3932 2.4506 1.3838 1.2781 2.8706 1.1847 4.0663 1.7620 1.3949 1.7560 1.4555 1.5994 2.8658 1.4056 2.1262 1.3288 1.2629 1.3971 1.8308 2.6653 1.9448 3.7532 1.2117 1.8887 1.7410 3.2026 1.5589 1.7638 3.0298 1.0882 3.8682 1.3318 7.2369 1.8997 2.7245 1.0863 1.0865 1.0892 1.0881 1.0515 1.0652 1.0876 1.0919 1.1170 1.1147 1.0987 1.0648 1.0442 1.0667 1.1056
irintensity: 0.4542 1.6931 1.6147 0.9743 9.6407 2.2202 0.8757 3.4957 3.3705 7.9014 2.6592 38.1660 14.8579 11.8392 7.7337 6.2131 2.4351 16.9270 4.0650 2.0873 2.9751 262.1158 149.5483 7.0939 2.9105 8.9854 0.8072 9.2827 40.3914 10.8990 34.5910 14.5081 13.5103 8.7912 59.8507 9.3537 6.2746 22.3139 14.2523 17.3636 28.8968 15.1491 40.5388 18.5411 17.9281 7.8688 137.6556 81.9094 6.3127 39.2242 52.0882 72.0916 6.9217 1.7182 0.1456 31.3081 23.1619 0.8092 56.2462 74.5388 4.1100 68.7738 2.0930 8.7545 22.5096 5.4787 12.2787 85.9535 14.5575 23.7432 20.2140 30.6794 121.9766 7.7648 14.7547 11.3174 10.1493 58.7653 9.2319 13.6612 2.5676 67.6968 33.1592 605.5536 5.1430 31.2185 7.5706 10.0496 16.7734 20.0085 6.4272 16.8497 0.1530 22.1884 3.1924 51.9547 125.1498 17.7232 49.9174
temp: 298.150 k
press: 1.00000 atm
elementType: 8 8 8 7 7 7 7 7 6 6 6 6 6 6 6 6 6 6 6 6 1 1 1 1 1 1 1 1 1 1 1 1 1 1 1
symmnumber: 1
zpe: 716769.6 jmol-1
zpe.correction: 0.273003 hartree
zpe.thermalcorrener: 0.290627 hartree
zpe.thermalcorrenthalpy: 0.291571 hartree
zpe.thermalcorrgfe: 0.225291 hartree
zpe.sumelectzpe: -964.180372 hartree
zpe.sumelectthermal: -964.162748 hartree
zpe.sumelectthermalent: -964.161804 hartree
zpe.sumelectthermalfe: -964.228084 hartree
dipole: 0.7612 -1.8440 -3.2153
dipole: 3.7839
quadrupole: -110.2300 -117.1445 -115.7425
quadrupole: 7.9692 -6.0958 -4.6319
quadrupole: 4.1424 -2.7722 -1.3702 7.9692 -6.0958 -4.6319
hfenergy: -964.453375 hartree
pointgroup: C01 [X(C12H15N5O3)]
dipole: 0.5047945 -0.5906967 -1.2698375 debye
polarizability: 206.5208978|8.5584148|173.7127571|28.9805743|-5.9276211|127.411995 unknown
InChI: InChI=1S/C12H15N5O3/c13-10-6-11(15-3-14-10)17(4-16-6)12-8(19)7(18)9(20-12)5-1-2-5/h3-5,7-9,12,18-19H,1-2,13H2
charge 0 multiplicity 1
35 atoms
O  1.946071 -0.114543 1.628984
O  3.164056 2.229078 -0.767248
O  1.755318 2.873046 1.436033
N  -0.340353 -0.174889 0.902819
N  -1.549848 -2.110693 0.601801
N  -1.840464 1.406549 -0.341155
N  -3.811166 0.261644 -1.270961
N  -4.189221 -2.056354 -0.999212
C  3.044442 -1.163506 -0.328572
C  2.829601 0.123972 0.434392
C  4.314783 -1.311639 -1.186632
C  4.150153 -2.135159 0.09864
C  2.136324 1.244575 -0.38462
C  1.099723 1.878188 0.5931
C  0.734805 0.684282 1.495334
C  -1.472864 0.183486 0.150819
C  -0.452267 -1.557347 1.148281
C  -2.198054 -1.029523 -0.022623
C  -3.410782 -0.954645 -0.768782
C  -3.017831 1.350424 -1.032516
H  2.123289 -1.607091 -0.725516
H  3.788122 0.509803 0.828888
H  4.226822 -1.824264 -2.148434
H  5.032474 -0.485365 -1.180049
H  4.760336 -1.862786 0.965269
H  3.954651 -3.20675 0.005986
H  1.631558 0.834209 -1.278928
H  0.220081 2.311181 0.085982
H  0.439416 1.012589 2.504979
H  2.882555 2.711347 -1.58432
H  2.581281 3.154079 0.951701
H  0.309056 -2.085991 1.715264
H  -3.37486 2.296705 -1.450016
H  -3.908275 -2.960962 -0.626621
H  -5.050531 -1.950552 -1.531064
