program: Gaussian 09
title: 000285638
version: EM64L-G09RevD.01
frameworkgroup: C1[X(C7H10N2O4)]
method: RPBEPBE
basis: SDD
operation: Freq
keyword: #p
keyword: freq=noraman
keyword: PBEPBE/SDD
title: #p freq=noraman PBEPBE/SDD
converged: YES YES NO NO
title: Mulliken charges:
elementType: O O O O N N C C C C C C C H H H H H H H H H H
charge: -0.255678 -0.246236 -0.235508 -0.230710 -0.002499 0.015830 -0.280890 -0.380202 -0.527070 0.226213 0.282120 -0.502678 -0.501484 0.318297 0.319415 0.274580 0.266591 0.245561 0.243956 0.239058 0.247873 0.240132 0.243330
chargesum: 0.00000
title: Mulliken charges with hydrogens summed into heavy atoms:
elementType: O O O O N N C C C C C C C
charge: -0.255678 -0.246236 -0.235508 -0.230710 -0.002499 0.015830 0.037407 -0.060788 0.014100 0.226213 0.282120 0.225897 0.229851
polarizability: 1.19845148e+02 -3.33090159e+00 1.04783379e+02 -6.84372114e+00 1.42091466e-01 8.37667697e+01
1716.lowfreq: -10.7414 -3.0362 0.0006 0.0007 0.0011 2.5115 12.3930 37.9018 43.5836
frequency: 11.2582 37.8984 43.5522 93.6629 99.5394 113.0372 120.9412 140.3822 195.9903 216.3515 233.0450 287.1971 304.2560 349.4788 392.6685 428.0425 581.7422 616.6927 694.5599 705.4645 715.7185 771.7919 821.1901 834.7127 848.7588 882.4157 897.5136 962.9488 990.2555 1010.1490 1066.4527 1113.4520 1113.5473 1129.3913 1135.7056 1150.1660 1152.0159 1160.4681 1203.5600 1240.2941 1264.8293 1307.1170 1356.9629 1421.7506 1422.4539 1425.5927 1453.0961 1454.2943 1461.6785 1462.6459 1503.9844 1632.9686 1638.7297 3008.1647 3009.0792 3023.2020 3056.8925 3076.0018 3098.7174 3111.5096 3113.2095 3155.3354 3157.4091
redmass: 5.7200 4.6220 5.9987 1.0658 1.1105 4.2445 3.3846 4.0999 4.8340 3.7958 6.2339 4.4184 5.2913 5.1483 5.3099 4.8809 5.5695 6.3260 5.6785 7.1697 5.0990 6.3737 5.9674 7.4591 5.9628 5.3008 3.6762 4.8386 2.8044 4.0408 3.4890 1.2702 1.2684 2.1861 2.3424 1.4619 1.4309 1.3715 1.2242 1.5189 1.3479 1.5014 1.8903 1.2154 1.2021 1.1662 1.0498 1.0496 1.0507 1.0511 5.3339 9.0842 8.9325 1.0295 1.0295 1.0615 1.0853 1.0871 1.1014 1.1048 1.1049 1.1050 1.1050
irintensity: 1.7156 2.0731 2.6399 0.1726 0.7758 0.2431 6.9434 1.7828 9.5224 2.4717 2.8684 39.5973 17.4276 1.4668 0.5822 0.5230 25.8123 25.4086 9.7741 2.5401 12.5805 42.0227 14.0689 22.5195 10.9288 3.1174 10.6491 18.6012 28.2256 7.9024 55.5538 0.2670 0.1740 261.3826 118.2494 30.2224 13.6561 83.0930 37.7097 193.7778 23.3830 55.6215 70.3819 17.0381 48.2657 19.8612 15.7350 15.3343 14.0589 9.9290 32.2333 280.8463 32.0009 31.6043 27.0658 6.1249 0.9273 2.1278 3.5849 22.1684 22.3186 13.5296 13.5553
temp: 298.150 k
press: 1.00000 atm
elementType: 8 8 8 8 7 7 6 6 6 6 6 6 6 1 1 1 1 1 1 1 1 1 1
symmnumber: 1
zpe: 451482.0 jmol-1
zpe.correction: 0.171960 hartree
zpe.thermalcorrener: 0.185867 hartree
zpe.thermalcorrenthalpy: 0.186812 hartree
zpe.thermalcorrgfe: 0.128185 hartree
zpe.sumelectzpe: -682.092292 hartree
zpe.sumelectthermal: -682.078385 hartree
zpe.sumelectthermalent: -682.077441 hartree
zpe.sumelectthermalfe: -682.136067 hartree
dipole: -1.6335 -3.2148 0.8400
dipole: 3.7026
quadrupole: -58.7568 -76.3732 -83.6314
quadrupole: -5.2853 -5.4081 5.3534
quadrupole: 14.1637 -3.4527 -10.7109 -5.2853 -5.4081 5.3534
hfenergy: -682.2642526 hartree
pointgroup: C01 [X(C7H10N2O4)]
dipole: 0.6745015 1.249471 0.3253741 debye
dipolederiv: -0.9154412 -0.4947283 -0.1649271 -0.6051932 -0.7850851 -0.2582897 -0.2875979 -0.3426029 -0.5934261 -1.03925 0.4908403 -0.3271194 0.4712114 -0.550035 0.1838179 -0.4513293 0.2758756 -0.7052516 -0.6243006 -0.0947598 0.2081828 -0.1816038 -0.4448562 -0.0853895 0.0793517 -0.1822559 -0.8112015 -0.5971059 0.2356329 0.0806771 0.1707421 -0.4219619 -0.1270314 -0.108908 -0.0862736 -0.8538194 -0.5171357 0.0272437 -0.0238342 -0.1040408 0.8084836 0.0086239 -0.07633 -0.2162529 -0.2100222 0.2342083 0.1775232 0.2167135 0.0827576 -0.7457444 0.0452951 0.1781262 0.2644828 -0.1110733 -0.3788403 -0.0850549 -0.0169139 -0.1877215 -0.2736734 0.0643202 0.0531286 0.0678295 -0.0294291 0.1363602 0.0214172 0.0000535 0.3259638 -0.600288 0.01952 0.1813894 -0.0509081 0.1212521 -0.1757159 -0.0587009 -0.1585614 -0.0264966 0.4145099 -0.1075732 -0.135895 -0.0479607 0.1965399 1.2126144 0.6299558 -0.0984945 0.8279091 0.8439477 0.335209 0.0867697 0.4859273 1.0902998 1.2304174 -0.8473667 0.2382936 -0.7185976 0.661808 -0.0045767 0.4375979 -0.1185545 1.2646449 0.5422407 0.2001904 0.04869 0.1761801 0.3894431 0.0109495 -0.0386825 -0.0460599 0.2154672 0.558714 -0.1800458 0.0785329 -0.1907419 0.3937837 -0.0587013 -0.0126283 0.0027781 0.2123283 0.1276495 -0.0207753 0.0357871 -0.0365402 0.0633807 -0.0414712 0.0012305 -0.0305953 0.026641 0.1167709 -0.0129153 0.0162338 0.0053363 0.0898015 0.0013371 0.0013983 0.0045722 0.0260423 0.0116363 0.0565118 0.0198867 0.0086982 0.0853745 -0.0409566 0.0698298 -0.0521538 0.0620389 0.0968033 -0.018024 0.0140517 -0.0436544 0.0553064 0.0340562 -0.0428546 0.054064 -0.0385621 -0.0000735 0.0000142 -0.0684302 -0.0235035 0.0094325 0.066685 0.0152267 0.1409717 -0.0155468 -0.0639584 0.0081817 0.0134706 0.0943116 -0.0385693 -0.027158 0.0822078 0.0022172 0.096886 0.0565515 -0.0571804 -0.0255469 -0.0775767 0.0344643 -0.0790175 -0.0657643 -0.1053364 -0.0133212 -0.0361422 0.0085594 0.0301687 -0.0375747 -0.0087212 0.0801688 0.1242057 0.0420761 0.0446804 0.0323258 0.0540771 -0.064382 0.0490272 0.0939389 0.0253799 -0.104941 0.0530287 -0.0486009 -0.0083285 -0.0405964 -0.0525324 0.0211074 -0.0747402 -0.0451976 0.0144687 -0.114869 0.0734334 unknown
polarizability: 118.5590742|-3.5834809|105.0144477|9.1183087|-1.4490243|84.8217739 unknown
InChI: InChI=1S/C7H10N2O4/c1-12-6(10)4-3-8-9-5(4)7(11)13-2/h4-5H,3H2,1-2H3
charge 0 multiplicity 1
23 atoms
O  2.413811 1.189074 0.857886
O  -2.579191 1.111262 -0.838086
O  2.195417 0.096628 -1.190496
O  -1.969567 0.972042 1.409134
N  -1.245102 -1.694742 -0.382116
N  -0.469681 -2.510614 0.212255
C  0.561083 -0.314359 0.610655
C  -0.677736 -0.232324 -0.31714
C  0.75892 -1.85639 0.803783
C  1.781595 0.320812 -0.027971
C  -1.779069 0.676196 0.206961
C  3.636217 1.857669 0.342065
C  -3.760749 1.924678 -0.452121
H  0.345709 0.174766 1.57344
H  -0.436481 0.026583 -1.36289
H  1.628124 -2.256775 0.25018
H  0.840823 -2.163708 1.859142
H  3.38867 2.471386 -0.539926
H  4.391292 1.104999 0.060384
H  3.985621 2.481293 1.17603
H  -4.417623 1.341481 0.214089
H  -4.261444 2.156256 -1.401771
H  -3.436236 2.842888 0.065215
