program: Gaussian 09
title: 000285686
version: EM64L-G09RevD.01
frameworkgroup: C1[X(C19H19ClN6O)]
method: RPBEPBE
basis: SDD
operation: Freq
keyword: #p
keyword: freq=noraman
keyword: PBEPBE/SDD
title: #p freq=noraman PBEPBE/SDD
converged: YES YES NO NO
title: Mulliken charges:
elementType: Cl O N N N N N N C C C C C C C C C C C C C C C C C C C H H H H H H H H H H H H H H H H H H H
charge: -0.018863 -0.274074 -0.315349 -0.094447 -0.172664 -0.633916 -0.613954 -0.016765 0.187015 -0.685047 -0.703785 0.353163 0.231119 -0.024209 -0.316028 -0.378392 -0.349235 -0.325985 0.510528 -0.393875 0.395668 -0.527929 -0.370318 0.400894 -0.207641 -0.376115 -0.263630 0.237627 0.232184 0.211807 0.243024 0.205175 0.225658 0.285780 0.262158 0.257164 0.335525 0.340637 0.316464 0.320749 0.233065 0.230272 0.309501 0.235212 0.239414 0.262419
chargesum: 0.00000
title: Mulliken charges with hydrogens summed into heavy atoms:
elementType: Cl O N N N N N N C C C C C C C C C C C C C C C C C C C
charge: -0.018863 -0.274074 -0.315349 -0.094447 -0.172664 0.042245 0.023259 -0.016765 0.187015 -0.003429 -0.029928 0.353163 0.231119 -0.024209 -0.030248 -0.116234 -0.349235 -0.068820 0.510528 0.069462 0.395668 -0.218428 -0.135107 0.400894 0.031774 -0.113696 -0.263630
polarizability: 4.12998427e+02 2.48394299e+01 2.52336699e+02 -3.60707045e+00 1.68081725e+00 1.65013555e+02
1716.lowfreq: -4.0114 -1.3703 -0.0010 -0.0003 0.0008 6.8882 11.7448 14.5773 22.4943
frequency: 11.4416 14.1703 22.2624 32.1327 42.2016 59.4254 80.2591 97.7318 111.2283 120.5393 139.4440 145.1796 153.2303 180.3390 194.2965 206.5343 211.6858 223.9027 224.9616 271.5036 293.7183 304.2726 315.6061 333.3560 360.1491 371.6272 379.9236 381.3410 384.4455 388.6745 427.9074 447.0035 453.0184 456.0594 487.4169 504.0478 515.4231 518.3865 524.2916 532.1727 544.5953 563.4711 580.8497 594.9099 607.0062 621.2889 663.0527 670.4729 701.5982 706.5033 717.7596 724.9669 733.6638 801.4593 805.9459 814.3938 823.6468 860.1278 887.8541 910.1149 914.6939 929.3382 944.4599 947.3771 948.2164 960.3232 986.9849 989.9324 992.6787 993.2894 1022.5367 1033.5676 1050.0454 1096.8256 1105.4006 1119.9524 1130.0405 1141.5575 1155.5125 1187.3660 1190.8478 1213.0296 1215.9497 1241.5744 1250.3799 1259.1699 1288.4188 1300.3238 1337.4648 1358.0307 1366.3529 1381.5755 1386.0003 1399.1945 1403.9647 1432.2568 1446.2597 1449.8946 1459.6382 1463.2061 1470.1685 1472.8634 1476.8420 1485.3467 1532.7665 1551.6075 1569.7753 1590.5281 1603.6663 1610.7586 1616.2994 1617.8598 2181.2973 2943.1159 2980.0957 2996.9723 2997.1732 3079.9868 3093.3595 3099.7595 3109.6426 3121.6780 3151.2063 3152.8694 3167.7661 3172.1666 3173.0792 3182.7511 3554.0531 3567.7714 3708.5391 3729.9570
redmass: 10.8075 4.6777 5.1470 6.7005 6.2312 5.0561 5.7548 4.1406 9.1927 4.2745 4.9983 5.4679 7.1372 5.0604 5.1502 2.4889 2.6994 4.4437 1.7194 1.0295 3.9822 2.7192 2.8796 3.4512 5.9282 1.4168 1.3758 4.4579 2.3385 5.0335 4.6585 3.1763 3.1991 7.7627 3.1475 2.0209 2.0293 3.9312 1.5621 2.4821 2.9898 6.4189 4.5243 4.8277 4.7882 4.6060 6.4396 8.1746 2.0718 6.2533 4.4598 11.0256 5.9609 1.6730 1.8301 2.2849 5.8711 2.8177 1.5016 1.5848 1.3209 3.8121 1.5283 1.8561 1.4193 3.2930 6.1759 1.3724 1.3815 6.4961 1.7433 2.8075 3.4845 1.7560 1.9338 2.2296 2.0432 1.3220 1.7755 1.0895 3.4281 1.0636 1.9893 2.4640 3.5882 2.3419 3.6754 1.3711 3.9834 1.9651 1.2316 4.9789 1.2790 4.5517 4.4427 2.7947 4.3449 1.0554 1.0838 1.2697 1.0701 2.4711 1.0683 2.1820 2.5438 7.3990 1.7239 5.8056 3.5859 3.3623 5.4162 2.2825 12.6335 1.0551 1.0348 1.1019 1.0388 1.1004 1.0997 1.1006 1.0991 1.0894 1.0907 1.0878 1.0929 1.0988 1.0967 1.0935 1.0444 1.0437 1.1052 1.1058
irintensity: 0.2275 1.3488 0.4171 0.6496 0.1811 0.1264 0.6460 4.0947 1.0293 0.2957 0.4330 2.3874 2.0791 4.0372 3.9732 1.3949 1.6936 2.4533 1.5136 0.5294 3.0982 7.2105 2.5399 9.5741 12.7001 39.6535 297.8894 5.8066 29.2027 2.2705 13.4137 9.7282 5.3646 0.4746 28.9285 29.3582 25.5490 4.0420 5.1411 25.4403 14.5030 1.6994 11.8438 0.2470 8.8962 0.3160 1.4193 1.1532 26.4699 16.0053 5.1454 35.8308 56.7321 14.2999 61.0579 81.9517 4.4767 6.8457 3.5588 1.1367 0.5599 5.9145 4.5563 13.2799 13.8188 14.1091 0.4260 1.7030 1.5336 59.5399 3.4826 62.0784 13.2955 3.7521 6.1422 4.0862 53.4806 20.5248 17.5156 5.5042 29.7468 1.0770 187.8168 86.0908 83.5922 182.8257 1.6540 11.8819 11.0104 40.8941 35.4283 27.5073 25.1369 116.2798 365.2292 33.8347 141.8682 0.8701 10.4872 172.0526 6.7775 5.6472 31.4053 222.8890 273.7635 17.8587 181.4274 6.5911 307.7322 350.2576 41.3408 457.4696 23.3746 24.4121 15.7480 16.2269 23.7548 27.8617 13.3735 32.7798 30.6854 8.0357 8.2249 13.3411 1.2537 11.3437 3.8029 4.8410 57.4022 91.8274 57.7272 37.7678
temp: 298.150 k
press: 1.00000 atm
elementType: 17 8 7 7 7 7 7 7 6 6 6 6 6 6 6 6 6 6 6 6 6 6 6 6 6 6 6 1 1 1 1 1 1 1 1 1 1 1 1 1 1 1 1 1 1 1
symmnumber: 1
zpe: 924177.1 jmol-1
zpe.correction: 0.352000 hartree
zpe.thermalcorrener: 0.377901 hartree
zpe.thermalcorrenthalpy: 0.378845 hartree
zpe.thermalcorrgfe: 0.293236 hartree
zpe.sumelectzpe: -1597.274267 hartree
zpe.sumelectthermal: -1597.248366 hartree
zpe.sumelectthermalent: -1597.247422 hartree
zpe.sumelectthermalfe: -1597.333031 hartree
dipole: 0.4211 -6.6651 1.6635
dipole: 6.8825
quadrupole: -182.9765 -165.0869 -161.8610
quadrupole: -36.4280 -7.0010 -0.8573
quadrupole: -13.0017 4.8879 8.1138 -36.4280 -7.0010 -0.8573
hfenergy: -1597.6262671 hartree
pointgroup: C01 [X(C19H19Cl1N6O1)]
dipole: -0.0741018 -2.5198634 0.9883685 debye
polarizability: 414.0494291|-13.2960536|219.7520525|16.9687596|-41.5241312|196.5471998 unknown
InChI: InChI=1S/C19H19ClN6O/c1-19(2)25-17(22)24-18(23)26(19)14-6-7-16(15(20)9-14)27-11-13-5-3-4-12(8-13)10-21/h3-9H,11,22-23H2,1-2H3
charge 0 multiplicity 1
46 atoms
Cl -1.125574 2.055699 -1.510174
O  -2.131202 -0.229741 0.058246
N  3.53995 0.112795 -0.027445
N  5.678117 0.574216 1.144128
N  5.625404 -0.48395 -1.072098
N  3.614138 -1.021078 -2.11868
N  7.591958 -0.373642 0.175672
N  -7.229144 2.027557 -1.819505
C  4.298178 1.041573 0.957195
C  4.303764 2.478679 0.363519
C  3.59133 1.017667 2.325493
C  2.107085 0.002066 0.001514
C  4.28799 -0.444308 -1.060577
C  6.247211 -0.051267 0.120634
C  1.294255 0.951232 -0.679326
C  1.481595 -1.053449 0.707358
C  -0.10292 0.837303 -0.634796
C  0.076069 -1.160993 0.750508
C  -0.738205 -0.213184 0.079484
C  -2.823497 -1.289925 0.795417
C  -4.31974 -1.09669 0.615878
C  -4.83984 -0.055929 -0.181412
C  -5.206706 -1.991868 1.265879
C  -6.246873 0.087272 -0.328126
C  -6.603468 -1.849031 1.119929
C  -7.132587 -0.812149 0.324473
C  -6.780459 1.14916 -1.143345
H  4.897752 3.135318 1.022468
H  4.774109 2.479131 -0.636149
H  3.280891 2.891848 0.288729
H  4.177724 1.647425 3.014345
H  2.560559 1.4091 2.271417
H  3.577185 -0.007258 2.733106
H  1.75868 1.769104 -1.237737
H  2.107861 -1.786604 1.224394
H  -0.37988 -1.983928 1.30808
H  4.182556 -1.480546 -2.82556
H  2.606511 -0.945966 -2.225794
H  8.136084 -0.093142 0.986016
H  7.995716 -0.923318 -0.576352
H  -2.5506 -1.237088 1.870417
H  -2.511918 -2.281779 0.404997
H  -4.15655 0.634915 -0.681171
H  -4.808756 -2.803135 1.888464
H  -7.279325 -2.545323 1.626599
H  -8.213828 -0.693069 0.205387
