program: Gaussian 09
title: 000285612
version: EM64L-G09RevD.01
frameworkgroup: C1[X(C12H13NO)]
method: RPBEPBE
basis: SDD
operation: Freq
keyword: #p
keyword: freq=noraman
keyword: PBEPBE/SDD
title: #p freq=noraman PBEPBE/SDD
converged: NO YES NO NO
title: Mulliken charges:
elementType: O N C C C C C C C C C C C C H H H H H H H H H H H H H
charge: -0.289045 -0.237963 0.085650 0.241252 0.373295 0.384188 0.149186 -0.392975 -0.473597 -0.414562 -0.629870 -0.285579 -0.818428 -0.806122 0.247175 0.254305 0.226643 0.226841 0.226869 0.293387 0.231301 0.239450 0.236157 0.236161 0.236864 0.229693 0.229722
chargesum: 0.00000
title: Mulliken charges with hydrogens summed into heavy atoms:
elementType: O N C C C C C C C C C C C C
charge: -0.289045 -0.237963 0.085650 0.241252 0.373295 0.384188 0.149186 -0.145800 -0.219292 -0.187919 0.117228 -0.054277 -0.106660 -0.109843
polarizability: 1.91177202e+02 -1.15092157e+01 1.70110103e+02 1.81733656e-02 -8.90280594e-03 6.83639635e+01
1716.lowfreq: -58.4176 -5.8355 -3.3675 0.0004 0.0006 0.0007 10.2123 67.0738 72.6698
frequency: -58.3793 66.9900 72.5768 160.4766 182.5159 234.2159 247.0094 286.1083 324.7964 328.8004 332.2887 355.6971 410.4930 446.8568 456.5242 473.3145 515.7356 553.1270 561.1916 601.5810 608.1825 692.9833 698.0632 754.8480 763.4291 795.8847 857.9986 882.5727 909.2594 913.6108 972.5576 1000.6242 1022.6471 1036.5911 1047.2503 1049.4583 1112.3344 1113.7979 1134.6883 1181.4454 1182.6297 1212.5002 1252.0595 1288.0162 1300.5704 1353.1420 1383.9458 1395.2988 1400.4079 1413.9011 1436.9663 1463.8391 1470.7254 1472.6737 1475.7763 1478.2726 1506.2839 1522.4196 1569.4618 1576.6806 1608.5196 1660.9012 2980.2450 2998.4878 3018.6584 3057.6830 3087.5226 3088.6493 3097.6975 3113.9353 3125.7732 3128.5601 3150.3017 3169.9315 3172.9730
redmass: 2.8703 2.1642 1.3882 3.9700 2.6328 1.3336 2.4462 3.4531 4.4841 3.3231 3.6862 1.0347 6.7784 4.6561 3.4135 4.6744 5.0172 3.5074 5.1101 3.6570 3.6803 4.0903 5.7391 1.9770 4.7235 2.0733 4.5691 1.4041 1.3638 2.9883 1.3428 1.6127 1.4445 1.5230 1.5630 4.0431 1.3102 2.8197 2.2675 1.9345 1.4805 2.6796 1.8626 1.8622 3.2227 5.3271 2.1770 1.4598 1.2660 1.6179 1.7877 1.1819 2.4003 1.0460 1.0497 1.1444 1.0967 1.0496 6.1199 7.0825 5.7547 7.5964 1.0379 1.0362 1.0338 1.0972 1.0990 1.0984 1.0983 1.0993 1.0882 1.1022 1.0898 1.0929 1.0985
irintensity: 0.3025 4.8662 0.7690 0.7258 0.0354 0.1609 9.3664 0.5391 1.1446 2.1881 1.4462 0.0289 4.3328 10.3594 0.1234 1.6305 3.4291 0.1190 2.2973 1.6787 4.7960 0.0583 11.7506 43.1763 0.3285 21.2308 6.9000 26.5034 2.1829 14.2469 0.2763 0.8377 8.3649 4.1592 7.0756 31.0959 0.2166 17.5429 4.9603 4.4043 0.4428 14.5978 3.4842 29.0071 18.7991 29.5119 12.8229 9.4762 25.4985 10.4314 74.7560 113.0301 12.7628 15.5299 3.6869 15.0712 9.5890 35.2464 123.0203 88.0900 3.1766 217.4988 20.3201 9.9986 74.4747 15.8178 7.8541 18.5666 21.0873 0.3722 14.6216 33.3723 12.7730 4.0944 20.8518
temp: 298.150 k
press: 1.00000 atm
elementType: 8 7 6 6 6 6 6 6 6 6 6 6 6 6 1 1 1 1 1 1 1 1 1 1 1 1 1
symmnumber: 1
zpe: 578836.7 jmol-1
zpe.correction: 0.220467 hartree
zpe.thermalcorrener: 0.232190 hartree
zpe.thermalcorrenthalpy: 0.233134 hartree
zpe.thermalcorrgfe: 0.183194 hartree
zpe.sumelectzpe: -594.062911 hartree
zpe.sumelectthermal: -594.051189 hartree
zpe.sumelectthermalent: -594.050245 hartree
zpe.sumelectthermalfe: -594.100184 hartree
dipole: -3.7900 2.0311 -0.0007
dipole: 4.2999
quadrupole: -86.8299 -73.9472 -86.0333
quadrupole: 12.6432 0.0002 0.0004
quadrupole: -4.5597 8.3230 -3.7632 12.6432 0.0002 0.0004
hfenergy: -594.2833785 hartree
pointgroup: C01 [X(C12H13N1O1)]
dipole: 1.6005684 -0.5477751 -0.0002699 debye
polarizability: 194.2964142|-7.5511466|166.9908907|-0.0193726|0.0058509|68.3639635 unknown
InChI: InChI=1S/C12H13NO/c1-8-5-4-6-10-9(2)7-11(14)13(3)12(8)10/h4-7H,1-3H3
charge 0 multiplicity 1
27 atoms
O  -3.112208 1.444899 0.000523
N  -0.758867 1.223928 0.000318
C  0.407528 0.413636 0.000223
C  0.228498 -1.026696 0.00013
C  1.759393 0.936813 -0.000038
C  -1.112375 -1.606397 0.000311
C  -2.094383 0.677233 0.000134
C  1.357013 -1.893115 -0.000161
C  -2.203764 -0.770592 0.000367
C  2.832891 0.015995 -0.000386
C  -0.736243 2.708033 0.000437
C  2.657598 -1.385659 -0.000433
C  -1.306971 -3.110104 0.000379
C  2.185083 2.406295 -0.000124
H  1.194085 -2.974336 -0.000214
H  -3.226901 -1.15632 0.000545
H  3.851812 0.420268 -0.000604
H  -0.244472 3.101616 -0.901406
H  -0.245091 3.101481 0.90265
H  -1.789889 3.026647 0.000075
H  3.525584 -2.051986 -0.00069
H  -2.380404 -3.359772 0.000669
H  -0.848275 -3.579277 0.890975
H  -0.848757 -3.57928 -0.890469
H  3.28662 2.455793 -0.000374
H  1.839777 2.957168 -0.890764
H  1.840222 2.95723 0.890627
