program: Gaussian 09
title: 000285632
version: EM64L-G09RevD.01
frameworkgroup: C1[X(C14H20N2O4S)]
method: RPBEPBE
basis: SDD
operation: Freq
keyword: #p
keyword: freq=noraman
keyword: PBEPBE/SDD
title: #p freq=noraman PBEPBE/SDD
converged: YES YES NO NO
title: Mulliken charges:
elementType: S O O O O N N C C C C C C C C C C C C C C H H H H H H H H H H H H H H H H H H H H
charge: 0.875432 -0.522241 -0.553848 -0.275213 -0.269809 -0.369636 -0.425874 -0.333889 -0.670571 -0.041541 -0.388648 -0.348952 -0.255828 -0.255056 0.275951 0.448056 -0.686863 -0.360731 -0.359416 0.257361 -0.795783 0.221158 0.195338 0.290687 0.299972 0.208884 0.252682 0.207838 0.189756 0.290498 0.290595 0.366418 0.212373 0.215589 0.208228 0.248379 0.248641 0.397656 0.233926 0.233900 0.244582
chargesum: 0.00000
title: Mulliken charges with hydrogens summed into heavy atoms:
elementType: S O O O O N N C C C C C C C C C C C C C C
charge: 0.875432 -0.522241 -0.553848 -0.275213 -0.269809 -0.003218 -0.028219 0.082607 -0.079913 -0.041541 0.072918 0.048643 0.034671 0.035538 0.275951 0.448056 -0.050673 -0.112351 -0.110775 0.257361 -0.083376
polarizability: 3.05845504e+02 2.26524135e+01 1.57536349e+02 -2.29894065e+00 6.20673556e+00 1.79024592e+02
1716.lowfreq: -30.6618 -25.1920 -7.0186 0.0009 0.0010 0.0011 0.5248 5.9457 13.4785
frequency: -30.6245 -20.0307 12.5123 28.9214 38.1105 40.2620 55.3128 67.6251 76.0069 101.1150 121.9647 129.4519 135.3087 172.3695 184.5074 216.3335 221.8185 227.6614 246.4788 272.8869 287.7729 296.1441 310.0348 343.1930 373.1670 378.7147 408.5141 417.1208 455.1212 468.4325 511.5913 525.4048 566.9471 592.5631 621.1500 646.4378 701.5878 705.3706 710.5248 735.0455 765.4683 768.6054 784.5006 798.5713 829.4216 843.3662 849.1237 852.2506 884.4910 913.4284 934.6261 953.3039 964.7379 974.6540 984.5310 990.2568 991.3725 993.4138 1049.9300 1051.6321 1052.1324 1110.0271 1118.1436 1123.6794 1136.5094 1143.5315 1184.8699 1203.2376 1211.9834 1218.2529 1228.2738 1256.8631 1265.5241 1287.6006 1296.6315 1313.2794 1345.6012 1363.8548 1379.2194 1381.3250 1387.4758 1391.1705 1401.0818 1453.0753 1459.6495 1469.8430 1472.1010 1474.1844 1474.2003 1475.3952 1486.0905 1503.7627 1523.6611 1593.2907 1594.5292 1601.7132 1681.9258 2963.1939 2972.6760 2976.3465 2982.2225 2999.0744 3009.8203 3042.9620 3051.5216 3065.1948 3069.7608 3072.3195 3075.3882 3095.3889 3138.5630 3139.5767 3158.3465 3158.8838 3162.3593 3196.3673 3382.8537
redmass: 1.0160 4.3812 4.5770 4.8000 4.7044 4.4057 6.2998 1.6715 5.8868 4.4774 5.1337 4.2868 6.0194 3.8142 5.4356 3.1014 1.8171 2.4009 6.5515 4.9472 2.8190 4.3302 4.9294 4.7328 6.0610 3.5069 2.8773 6.0788 6.1681 3.9254 3.1434 3.3691 4.1580 5.9070 6.9593 4.9441 3.9182 3.4061 4.5845 1.2363 2.5849 1.7321 6.1458 1.8905 1.3456 2.3128 1.8615 1.4221 1.7512 1.1904 4.9860 2.1251 1.3069 1.9867 1.3757 1.8607 1.8794 5.3461 1.6236 2.4018 2.7889 2.7955 1.2994 2.1728 1.3600 1.9003 1.1474 2.5806 1.2617 2.9942 1.3335 3.0204 1.3029 1.1055 1.2648 1.2069 1.4420 1.3601 1.1029 5.8793 1.2120 2.9998 1.2179 1.1129 1.0802 1.1031 2.2992 1.0626 1.0682 1.0433 1.0792 1.9362 1.9533 5.9734 6.9419 3.7386 4.8874 1.0594 1.0375 1.0598 1.0393 1.0662 1.0954 1.1005 1.0580 1.0945 1.1006 1.0995 1.1022 1.1002 1.0885 1.0888 1.1069 1.0965 1.0974 1.0843 1.0813
irintensity: 0.5499 0.4740 0.8835 0.4275 0.5576 0.2809 1.0696 0.0281 2.9923 4.5815 3.0124 0.4727 2.0824 4.5635 3.1241 4.5536 1.3842 1.8339 35.2330 4.8845 4.3568 0.8796 1.0523 21.0561 8.6916 1.0581 0.0231 0.4225 100.7741 2.4331 83.8744 29.3967 8.9634 32.0048 0.3365 2.1357 33.4952 0.2941 0.6628 16.1727 51.2963 117.0638 26.9835 5.0285 42.3450 5.8796 16.1067 4.6730 9.3508 56.5594 73.4125 35.0380 2.7900 9.5669 0.0923 1.2827 1.7439 3.8588 25.3396 26.7058 3.0880 6.3567 9.4517 2.0611 4.7825 4.6729 18.1306 80.0932 15.3782 14.1306 2.4162 268.2762 25.9351 0.3745 2.5647 17.5216 3.2001 7.4108 18.5424 0.2956 10.2684 10.9855 17.8716 38.9040 3.1816 18.2132 35.8100 5.6740 17.4494 9.6596 15.7064 514.3431 370.9172 11.7197 0.3380 97.5606 325.9460 22.3198 27.2622 60.5356 20.5228 35.5510 2.6245 48.4028 1.9612 18.3575 85.4409 39.4443 25.5601 13.2669 11.6979 4.0779 1.5507 0.8160 16.3117 429.0187 165.7126
temp: 298.150 k
press: 1.00000 atm
elementType: 16 8 8 8 8 7 7 6 6 6 6 6 6 6 6 6 6 6 6 6 6 1 1 1 1 1 1 1 1 1 1 1 1 1 1 1 1 1 1 1 1
symmnumber: 1
zpe: 851488.0 jmol-1
zpe.correction: 0.324315 hartree
zpe.thermalcorrener: 0.345951 hartree
zpe.thermalcorrenthalpy: 0.346896 hartree
zpe.thermalcorrgfe: 0.270655 hartree
zpe.sumelectzpe: -1352.235317 hartree
zpe.sumelectthermal: -1352.213681 hartree
zpe.sumelectthermalent: -1352.212736 hartree
zpe.sumelectthermalfe: -1352.288977 hartree
dipole: 5.7284 6.0658 -1.9585
dipole: 8.5700
quadrupole: -87.5734 -143.4267 -142.0838
quadrupole: 11.8574 4.9226 7.8909
quadrupole: 36.7879 -19.0654 -17.7225 11.8574 4.9226 7.8909
hfenergy: -1352.5596319 hartree
pointgroup: C01 [X(C14H20N2O4S1)]
dipole: 2.2539384 -2.4684864 0.4412121 debye
polarizability: 305.3644501|-23.6421809|156.8151889|-4.480938|4.7246024|180.2268069 unknown
InChI: InChI=1S/C14H20N2O4S/c1-3-4-9-15-14(18)16-13(17)10-21(19,20)12-7-5-11(2)6-8-12/h5-8,15-16H,3-4,9-10H2,1-2H3
charge 0 multiplicity 1
41 atoms
S  1.494296 1.992316 0.065338
O  1.646127 3.131979 1.221544
O  0.872517 2.333488 -1.4289
O  -1.851834 0.501673 1.750376
O  -3.270457 2.663416 -1.619421
N  -3.907264 1.694754 0.423025
N  -1.633683 1.642871 -0.298775
C  -6.159479 0.874204 -0.369045
C  0.333638 0.565895 0.752098
C  3.172324 1.171191 -0.198388
C  -5.338171 2.014692 0.278876
C  -6.198221 -0.42283 0.469901
C  3.423185 0.543248 -1.428788
C  4.11905 1.275113 0.832894
C  -1.150211 0.930427 0.775789
C  5.686097 0.011937 -0.596242
C  -7.030504 -1.537394 -0.200114
C  4.696299 -0.039277 -1.61497
C  5.383349 0.682991 0.619266
C  -3.007813 2.042345 -0.552113
C  7.039028 -0.643049 -0.800645
H  -5.743591 0.663752 -1.373659
H  -7.194355 1.242775 -0.524181
H  0.538634 -0.277996 0.07248
H  0.694512 0.36676 1.770643
H  -5.737173 2.243376 1.285616
H  -5.415728 2.925981 -0.339195
H  -5.163764 -0.784964 0.635917
H  -6.617894 -0.197907 1.472411
H  2.66735 0.544838 -2.221203
H  3.885647 1.825037 1.750837
H  -3.551908 1.17105 1.236562
H  -6.61202 -1.802163 -1.189353
H  -7.049116 -2.454781 0.416489
H  -8.076737 -1.212582 -0.355631
H  4.926268 -0.53075 -2.56702
H  6.146146 0.750624 1.403053
H  -0.948189 1.987663 -1.006192
H  7.32923 -0.6528 -1.865242
H  7.830977 -0.125239 -0.232857
H  7.021035 -1.694862 -0.455284
