program: Gaussian 09
title: 000285616
version: EM64L-G09RevD.01
frameworkgroup: C1[X(C12H16ClNO3S)]
method: RPBEPBE
basis: SDD
operation: Freq
keyword: #p
keyword: freq=noraman
keyword: PBEPBE/SDD
title: #p freq=noraman PBEPBE/SDD
converged: YES YES NO NO
title: Mulliken charges:
elementType: Cl S O O O N C C C C C C C C C C C C H H H H H H H H H H H H H H H H
charge: -0.021565 0.869598 -0.527808 -0.566656 -0.254678 -0.347621 -0.329090 -0.380659 -0.663316 -0.340913 -0.047373 0.259697 -0.691536 -0.238972 -0.235632 -0.182456 -0.182575 -0.103683 0.197157 0.221085 0.243081 0.215583 0.298287 0.283689 0.200719 0.190499 0.358373 0.216195 0.215454 0.211996 0.294481 0.295836 0.270942 0.271861
chargesum: 0.00000
title: Mulliken charges with hydrogens summed into heavy atoms:
elementType: Cl S O O O N C C C C C C C C C C C C
charge: -0.021565 0.869598 -0.527808 -0.566656 -0.254678 0.010752 0.089152 0.078005 -0.081339 0.050305 -0.047373 0.259697 -0.047891 0.055509 0.060205 0.088486 0.089286 -0.103683
polarizability: 2.89551610e+02 2.49909406e+00 1.28517116e+02 8.39161933e-01 -9.77727343e+00 1.53113225e+02
1716.lowfreq: -12.1180 -1.9262 0.0015 0.0018 0.0022 3.8702 13.1720 14.1578 35.0459
frequency: 13.0348 14.0466 34.9481 41.1092 52.6348 67.2323 79.7292 104.0584 112.0790 122.0387 141.7984 205.1829 210.0901 227.7926 239.4032 251.7022 262.7535 280.5572 296.1177 345.2280 360.7517 391.1643 408.5631 410.0438 425.4661 485.5160 509.9453 553.0115 605.6996 611.2525 647.2464 695.1419 705.9881 736.6030 770.7580 780.6581 818.0190 832.9228 835.6695 846.3861 866.6460 901.0982 929.8303 952.9703 959.4700 973.2603 983.5583 1004.4544 1046.4469 1066.1604 1072.1148 1079.9940 1103.5174 1114.1877 1139.1771 1163.2356 1174.3195 1209.0613 1229.8053 1263.4038 1275.6031 1280.9481 1289.6436 1306.5050 1346.1096 1363.0593 1376.5137 1378.2921 1381.5084 1391.7866 1449.0499 1456.7496 1469.0388 1477.1356 1477.9862 1487.7828 1563.6129 1567.3042 1593.5807 1621.4303 2965.6292 2975.1196 2983.2840 3001.8710 3010.1965 3043.2922 3048.6331 3071.0367 3074.2574 3078.1288 3152.7674 3154.6722 3156.5713 3178.7139 3181.5051 3257.8943
redmass: 4.8508 5.0824 4.3465 6.4328 3.7919 2.3066 3.9541 2.4876 7.0949 6.5084 4.5445 8.4962 4.2945 1.5233 2.1500 5.3554 8.2113 4.1027 6.0861 7.6920 5.3832 6.1817 3.1400 2.9096 6.6549 4.3411 6.3964 4.5389 4.1570 7.1133 4.2828 4.8847 5.5816 1.0832 10.8974 1.3453 1.2012 1.2880 1.4005 2.1676 2.1866 1.7409 5.1104 1.3498 1.3315 1.3696 6.7474 4.4591 2.6865 3.1727 2.8423 3.3084 1.3235 2.3256 1.1985 1.8495 1.1286 1.2238 1.3381 2.1413 1.4574 1.2338 1.1222 1.1453 1.4193 1.3963 1.2859 2.0847 11.6833 1.2126 2.1303 1.0867 1.0705 1.0708 1.0421 1.0822 1.5345 5.9923 8.1828 7.1704 1.0588 1.0366 1.0603 1.0630 1.0977 1.1013 1.0576 1.1016 1.0995 1.1041 1.1072 1.0904 1.0898 1.0962 1.0969 1.0843
irintensity: 0.1919 0.2855 0.0898 1.1001 1.1519 2.3307 9.0651 0.4415 3.6043 1.8871 5.1368 4.2462 0.4062 1.2436 8.0421 1.8953 5.1543 10.3700 1.0537 23.0000 2.0665 2.2654 27.0073 0.0055 53.0169 17.0918 99.8394 10.4341 3.0648 0.4862 8.2006 9.4322 28.8254 8.7320 74.4128 1.8436 76.5503 14.1215 46.7454 10.5655 7.9704 6.5010 81.2976 3.4220 0.0100 0.1453 41.5856 3.5159 34.4782 67.6137 0.8927 7.2539 5.3992 15.0479 3.5295 4.3240 9.8405 3.7864 5.8698 87.5660 34.4949 2.0356 7.6968 1.0076 0.8705 8.3692 22.3707 13.7900 1.7956 10.4648 62.3957 10.6427 0.5214 6.4038 13.2655 15.1224 270.2079 43.2089 1.5399 191.1125 29.5751 32.1601 20.9281 56.6537 9.8494 12.3317 4.8159 20.9282 56.3226 71.4221 0.5600 3.2435 2.5929 0.3568 3.7254 308.6225
temp: 298.150 k
press: 1.00000 atm
elementType: 17 16 8 8 8 7 6 6 6 6 6 6 6 6 6 6 6 6 1 1 1 1 1 1 1 1 1 1 1 1 1 1 1 1
symmnumber: 1
zpe: 685772.8 jmol-1
zpe.correction: 0.261197 hartree
zpe.thermalcorrener: 0.281266 hartree
zpe.thermalcorrenthalpy: 0.282211 hartree
zpe.thermalcorrgfe: 0.208258 hartree
zpe.sumelectzpe: -1603.905320 hartree
zpe.sumelectthermal: -1603.885251 hartree
zpe.sumelectthermalent: -1603.884307 hartree
zpe.sumelectthermalfe: -1603.958259 hartree
dipole: -2.5624 1.5877 -1.5902
dipole: 3.4081
quadrupole: -114.8662 -132.5728 -122.4063
quadrupole: -3.6992 -10.1136 -7.3077
quadrupole: 8.4156 -9.2910 0.8754 -3.6992 -10.1136 -7.3077
hfenergy: -1604.166517 hartree
pointgroup: C01[X(C12H16Cl1N1O3S1)]
dipole: -0.9716707 0.6954976 0.6082661 debye
polarizability: 289.4423868|-3.6264345|154.5671163|-2.7485706|7.8549846|127.1724484 unknown
InChI: InChI=1S/C12H16ClNO3S/c1-2-3-8-14-12(15)9-18(16,17)11-6-4-10(13)5-7-11/h4-7,14H,2-3,8-9H2,1H3
charge 0 multiplicity 1
34 atoms
Cl -6.698678 0.67161 0.53194
S  -0.329116 0.110007 -0.375583
O  -0.106621 -1.039764 -1.512417
O  0.244548 1.651114 -0.575397
O  2.570099 -1.211188 2.177188
N  2.527709 0.71063 0.830533
C  4.736605 0.343297 -0.321835
C  3.981294 0.956795 0.880583
C  0.43656 -0.529981 1.321392
C  6.251508 0.64317 -0.264422
C  -2.188625 0.274822 -0.078054
C  1.959698 -0.366683 1.448413
C  7.020851 0.034804 -1.456657
C  -2.683756 1.492351 0.417714
C  -3.001381 -0.817509 -0.423561
C  -4.079151 1.61297 0.606108
C  -4.395956 -0.693171 -0.232915
C  -4.906626 0.515614 0.285619
H  4.313011 0.738254 -1.26687
H  4.5710 -0.751215 -0.327428
H  4.36434 0.524423 1.822018
H  4.14414 2.050953 0.911095
H  0.163989 -1.594958 1.348532
H  -0.105493 0.046396 2.090114
H  6.666836 0.248337 0.685059
H  6.409532 1.741232 -0.243402
H  1.921401 1.312485 0.240255
H  8.102111 0.255851 -1.394319
H  6.900655 -1.064303 -1.484804
H  6.647386 0.437345 -2.416973
H  -2.008158 2.330405 0.617248
H  -2.564049 -1.723837 -0.855342
H  -4.512153 2.542121 0.98638
H  -5.069117 -1.515878 -0.488212
