program: Gaussian 09
title: 000285594
version: EM64L-G09RevD.01
frameworkgroup: C1[X(C14H11NO2)]
method: RPBEPBE
basis: SDD
operation: Freq
keyword: #p
keyword: freq=noraman
keyword: PBEPBE/SDD
title: #p freq=noraman PBEPBE/SDD
converged: YES YES NO NO
title: Mulliken charges:
elementType: O O N C C C C C C C C C C C C C C H H H H H H H H H H H
charge: -0.205249 -0.206326 0.021927 0.544650 0.492162 -0.531596 -0.320079 0.362414 -0.402128 -0.310143 -0.375762 -0.197249 -0.386587 -0.399706 -0.234592 -0.236843 -0.239814 0.285120 0.223898 0.232982 0.211771 0.288297 0.237779 0.225241 0.227158 0.229445 0.230085 0.233145
chargesum: 0.00000
title: Mulliken charges with hydrogens summed into heavy atoms:
elementType: O O N C C C C C C C C C C C C C C
charge: -0.205249 -0.206326 0.021927 0.544650 0.492162 -0.246475 -0.096180 0.362414 -0.169146 -0.098371 -0.087465 0.040529 -0.161346 -0.172548 -0.005147 -0.006758 -0.006670
polarizability: 3.67015528e+02 -9.36903643e+00 1.76473485e+02 1.69953597e-01 2.54544297e-01 6.22611393e+01
1716.lowfreq: -1.7880 -0.0004 0.0004 0.0006 4.6590 12.6930 24.5558 45.8482 58.6148
frequency: 23.9997 45.8460 58.6141 69.0291 98.4368 167.4688 173.2805 200.7387 234.4842 285.2182 292.9090 384.2216 402.3103 425.3201 455.3414 480.3082 518.4657 545.2691 546.7588 615.8543 638.1187 669.2890 681.0963 695.0214 704.1105 766.6735 769.5625 816.4975 844.9443 849.4285 877.9445 902.7206 922.5556 935.0700 946.7662 978.3849 985.3220 985.9462 987.8961 997.9397 1001.7693 1026.4929 1084.1867 1089.1592 1092.1658 1174.2296 1179.8705 1192.8446 1200.1151 1220.9730 1246.7085 1290.4290 1298.8971 1321.9027 1342.3244 1372.8467 1385.2016 1398.5551 1436.9000 1444.0273 1476.8305 1490.7938 1575.3696 1582.8725 1605.6055 1616.8700 1649.2477 3091.6956 3108.0011 3118.8193 3128.0781 3140.0693 3141.6443 3150.6238 3161.6947 3166.2831 3167.1642 3189.9548
redmass: 4.1493 8.9005 6.0505 5.8315 3.4453 4.7958 6.4987 6.7312 2.2429 4.1799 6.0785 8.3199 2.7684 3.2064 5.4015 3.0951 6.3582 6.3497 4.3049 6.4368 6.4837 8.1037 2.2634 1.7164 4.1102 9.2400 1.8065 1.5251 1.2876 4.5820 1.6704 4.3544 1.4578 1.5797 1.5406 1.3893 1.2294 5.5034 6.1360 1.3524 1.2836 2.1906 1.6404 1.7912 1.7178 1.0668 1.1489 1.1148 3.1161 5.6297 1.5363 2.4434 1.4606 1.3524 1.2771 10.2371 6.5384 4.4867 3.1770 2.4223 2.4115 2.5724 6.1530 5.5750 6.0379 6.4932 5.3278 1.0908 1.0873 1.0874 1.0858 1.0911 1.0872 1.0961 1.0943 1.0921 1.1015 1.0960
irintensity: 0.5846 0.0069 1.4571 0.6883 0.2178 0.9476 0.9495 0.0187 0.0185 0.0065 0.3754 0.9017 0.0100 0.2037 0.0456 1.9757 9.1137 15.6475 14.5421 0.0208 1.1729 16.6525 11.6506 86.9269 2.0703 21.0092 40.2111 40.4799 0.0627 0.5470 1.3647 1.8911 2.1760 0.4431 9.2869 0.4859 50.0898 2.4064 0.1138 0.3115 20.9043 4.7889 18.6794 5.4645 20.8654 1.4424 23.0491 2.0039 33.6844 291.2462 3.3876 11.9805 0.0564 0.0214 7.3000 116.7794 3.6321 10.0662 1.3593 19.6917 12.5923 51.2887 4.7859 1.7372 15.6456 30.6877 22.4147 8.1258 28.2477 12.3196 1.6335 5.5700 6.4166 38.1779 15.1399 5.5614 33.3709 6.0440
temp: 298.150 k
press: 1.00000 atm
elementType: 8 8 7 6 6 6 6 6 6 6 6 6 6 6 6 6 6 1 1 1 1 1 1 1 1 1 1 1
symmnumber: 1
zpe: 558299.4 jmol-1
zpe.correction: 0.212645 hartree
zpe.thermalcorrener: 0.226673 hartree
zpe.thermalcorrenthalpy: 0.227617 hartree
zpe.thermalcorrgfe: 0.169600 hartree
zpe.sumelectzpe: -744.023880 hartree
zpe.sumelectthermal: -744.009852 hartree
zpe.sumelectthermalent: -744.008908 hartree
zpe.sumelectthermalfe: -744.066925 hartree
dipole: 5.1460 3.2784 -0.0195
dipole: 6.1016
quadrupole: -111.2864 -89.1888 -104.3509
quadrupole: -14.5703 0.1260 0.1113
quadrupole: -9.6777 12.4199 -2.7422 -14.5703 0.1260 0.1113
hfenergy: -744.2365255 hartree
pointgroup: C01 [X(C14H11N1O2)]
dipole: -2.0166033 1.2806336 0.236522 debye
polarizability: 366.916804|9.2887641|174.3906969|-6.5197677|14.9163395|64.442651 unknown
InChI: InChI=1S/C14H11NO2/c16-15(17)14-8-4-7-13(11-14)10-9-12-5-2-1-3-6-12/h1-11H
charge 0 multiplicity 1
28 atoms
O  5.65822 -0.614237 -0.30899
O  4.12201 -2.287595 -0.497279
N  4.4423 -1.047417 -0.33329
C  0.944902 0.408382 -0.028766
C  -2.96395 0.138321 0.029218
C  2.014316 -0.514794 -0.18828
C  -0.434789 -0.101742 -0.063269
C  3.34578 -0.057972 -0.162074
C  1.277198 1.785672 0.156304
C  -1.580782 0.638864 0.062513
C  3.67831 1.301114 0.019548
C  2.617442 2.219399 0.179434
C  -3.298813 -1.238602 -0.136961
C  -4.030314 1.073582 0.170598
C  -4.643368 -1.655618 -0.160223
C  -5.377117 0.656444 0.147318
C  -5.690969 -0.712063 -0.018342
H  1.822841 -1.582482 -0.333328
H  -0.519574 -1.187626 -0.206528
H  0.479913 2.525121 0.28408
H  -1.493284 1.726042 0.203441
H  4.726609 1.608878 0.032371
H  2.841518 3.281355 0.323382
H  -2.506912 -1.987392 -0.247967
H  -3.793335 2.137237 0.299816
H  -4.880541 -2.717599 -0.288895
H  -6.179372 1.394205 0.257991
H  -6.735539 -1.041476 -0.036818
