program: Gaussian 09
title: 000285628
version: EM64L-G09RevD.01
frameworkgroup: C1[X(C13H19NO3S)]
method: RPBEPBE
basis: SDD
operation: Freq
keyword: #p
keyword: freq=noraman
keyword: PBEPBE/SDD
title: #p freq=noraman PBEPBE/SDD
converged: YES YES NO NO
title: Mulliken charges:
elementType: S O O O N C C C C C C C C C C C C C H H H H H H H H H H H H H H H H H H H
charge: 0.880181 -0.531268 -0.557814 -0.280361 -0.102700 -0.768223 0.308370 -0.069238 -0.322378 -0.375358 -0.251325 -0.239883 -0.669843 -0.652544 0.450073 -0.390463 -0.334780 -0.798570 0.305030 0.311430 0.260102 0.205494 0.254749 0.217639 0.291087 0.288680 0.207573 0.253113 0.219198 0.198440 0.275824 0.222437 0.244874 0.244671 0.235016 0.228782 0.241981
chargesum: 0.00000
title: Mulliken charges with hydrogens summed into heavy atoms:
elementType: S O O O N C C C C C C C C C C C C C
charge: 0.880181 -0.531268 -0.557814 -0.280361 -0.102700 -0.151762 0.308370 -0.069238 0.143218 0.097030 0.039762 0.048797 0.010041 0.044158 0.450073 -0.145590 -0.090108 -0.092790
polarizability: 2.66568958e+02 -1.15889267e+01 1.65088545e+02 -7.17793680e+00 -1.64994671e+01 1.36819119e+02
1716.lowfreq: -18.7721 -8.9268 -0.0014 0.0006 0.0019 1.6830 13.9780 24.9424 33.1627
frequency: 3.3780 24.6874 33.0400 41.1457 46.2361 56.3602 88.5653 110.0723 125.3811 132.9558 138.6550 160.7225 203.1222 212.6966 222.0210 229.7740 277.9226 300.0864 302.3941 316.3359 344.9131 377.6980 383.3653 407.4123 416.5805 447.0808 469.4812 502.7715 521.4937 574.8755 590.6555 621.5190 681.6034 705.9528 712.5977 773.4919 775.4307 788.5537 802.5578 829.0054 851.2756 869.8132 917.8254 929.4702 952.3071 963.9607 982.5751 987.7649 997.5658 1024.5144 1050.2129 1052.6444 1070.9749 1079.9505 1089.6884 1105.7303 1117.8513 1170.3656 1183.7104 1204.7922 1217.3099 1219.3982 1267.2817 1296.1260 1299.0771 1337.7244 1351.3467 1378.8874 1380.2436 1390.0756 1397.8663 1401.3512 1404.0950 1423.4678 1454.5222 1465.7280 1470.2780 1471.4035 1472.7961 1475.6990 1483.5172 1485.1859 1498.9870 1573.9832 1594.2749 1595.9848 2979.0548 2983.0401 2985.4770 2990.4783 3024.3162 3057.1411 3063.0515 3064.0050 3073.2393 3086.6577 3088.7562 3094.0408 3105.0995 3106.9456 3133.9526 3137.7968 3157.7753 3158.8120 3160.9678
redmass: 2.9984 3.9411 3.7890 1.1697 2.8619 4.7222 4.9733 5.4498 3.6053 5.1579 5.1315 2.0451 2.1754 1.4251 3.3427 1.9756 4.7746 2.7889 4.0506 3.1645 3.7640 3.2949 3.8082 2.8717 4.4661 3.3578 3.5211 4.0468 4.0070 4.3717 5.3614 6.9575 3.8080 3.8576 3.6559 2.3194 1.6746 3.7623 1.4147 1.3678 1.2497 2.4316 2.6087 3.8754 2.1873 1.3073 1.4146 1.7443 2.9304 2.5623 1.5887 2.4600 2.1896 1.8516 1.2458 1.7412 1.2903 2.0075 1.1425 2.5960 2.9213 1.2317 1.4167 1.2631 1.3257 1.2329 1.2861 1.2240 5.0106 2.9778 1.1944 1.2838 1.6193 1.6204 1.1043 1.0458 1.0553 1.0472 2.2331 1.1216 1.0733 1.0511 1.0807 5.7091 6.6248 6.2464 1.0657 1.0379 1.0359 1.0364 1.0597 1.0600 1.0968 1.0923 1.1005 1.1003 1.0993 1.0992 1.1028 1.1019 1.0890 1.0887 1.0958 1.1095 1.0972
irintensity: 0.6238 2.1243 0.6234 1.1688 1.0680 1.1452 6.6627 2.7971 0.9751 1.2365 0.8415 1.9706 3.7294 0.6464 13.3408 2.1073 6.5300 2.9547 0.3207 1.7141 6.1742 1.8376 3.4260 0.0857 41.3752 54.7460 10.4216 38.2597 49.3472 13.4722 27.4334 0.4250 0.8637 0.6769 1.4771 5.7587 15.1406 56.7572 20.7279 37.0151 2.2910 14.2682 29.4576 38.3355 3.2693 0.9439 0.2636 0.9658 7.1034 0.7966 17.3202 23.8574 16.8625 12.9499 45.1025 13.4209 7.8896 7.7594 13.0145 21.2902 5.4925 8.2549 61.8663 2.5212 27.4892 3.3590 8.5180 23.8144 2.5385 10.7602 22.9759 16.3521 17.2258 88.4744 24.8168 8.7783 15.3426 3.9037 29.2514 16.0897 12.8936 3.1867 23.1190 229.2524 3.8447 4.2226 40.4114 25.8742 38.8938 38.9599 24.3983 2.4317 16.1898 3.1764 16.3426 43.3906 17.8856 16.7095 14.9206 23.2445 11.0196 8.1238 2.0990 0.1398 13.5769
temp: 298.150 k
press: 1.00000 atm
elementType: 16 8 8 8 7 6 6 6 6 6 6 6 6 6 6 6 6 6 1 1 1 1 1 1 1 1 1 1 1 1 1 1 1 1 1 1 1
symmnumber: 1
zpe: 781238.0 jmol-1
zpe.correction: 0.297558 hartree
zpe.thermalcorrener: 0.318243 hartree
zpe.thermalcorrenthalpy: 0.319188 hartree
zpe.thermalcorrgfe: 0.243782 hartree
zpe.sumelectzpe: -1183.735298 hartree
zpe.sumelectthermal: -1183.714613 hartree
zpe.sumelectthermalent: -1183.713669 hartree
zpe.sumelectthermalfe: -1183.789074 hartree
dipole: 2.4202 -0.7472 -2.5910
dipole: 3.6234
quadrupole: -77.8266 -129.7987 -117.0604
quadrupole: -9.6068 0.3114 -3.9502
quadrupole: 30.4019 -21.5701 -8.8318 -9.6068 0.3114 -3.9502
hfenergy: -1184.0328563 hartree
pointgroup: C01 [X(C13H19N1O3S1)]
dipole: 0.9044034 -0.7713116 0.7869595 debye
polarizability: 265.5437|-4.8769496|158.2512743|17.6010919|19.8992142|144.6816485 unknown
InChI: InChI=1S/C13H19NO3S/c1-4-14(5-2)13(15)10-18(16,17)12-8-6-11(3)7-9-12/h6-9H,4-5,10H2,1-3H3
charge 0 multiplicity 1
37 atoms
S  0.11143 -0.800399 -0.794796
O  -0.31539 0.642876 -1.436615
O  -0.024758 -2.184838 -1.668017
O  -2.092689 0.68525 1.959209
N  -3.227662 -0.375708 0.219573
C  -0.926149 -1.113534 0.872027
C  -2.127229 -0.19419 1.032989
C  1.902587 -0.667256 -0.204848
C  -4.415067 0.473277 0.498382
C  -3.329223 -1.345644 -0.899848
C  2.713478 -1.80708 -0.301056
C  2.361739 0.578084 0.256231
C  -5.30063 -0.11514 1.617721
C  -3.360807 -0.673531 -2.29112
C  4.573394 -0.461768 0.605856
C  4.060129 -1.690241 0.114319
C  3.708776 0.66591 0.667277
C  6.023635 -0.338054 1.036054
H  -1.138852 -2.191113 0.796688
H  -0.209217 -0.88706 1.673659
H  -4.05336 1.471711 0.79743
H  -4.987333 0.57586 -0.439531
H  -2.4722 -2.039851 -0.8687
H  -4.245773 -1.950023 -0.74647
H  2.309148 -2.740448 -0.707077
H  1.6974 1.448491 0.27457
H  -5.659738 -1.128283 1.359623
H  -4.733911 -0.168319 2.562506
H  -6.18369 0.529386 1.780844
H  -4.256969 -0.040938 -2.423534
H  -2.461626 -0.051643 -2.43464
H  -3.376177 -1.453371 -3.073493
H  4.718627 -2.563707 0.050155
H  4.095166 1.623334 1.035849
H  6.107966 0.126271 2.035353
H  6.523297 -1.320508 1.072721
H  6.590877 0.300797 0.332808
