program: Gaussian 09
title: 000285598
version: EM64L-G09RevD.01
frameworkgroup: C1[X(C12H21N3O)]
method: RPBEPBE
basis: SDD
operation: Freq
keyword: #p
keyword: freq=noraman
keyword: PBEPBE/SDD
title: #p freq=noraman PBEPBE/SDD
converged: NO YES NO NO
title: Mulliken charges:
elementType: O N N N C C C C C C C C C C C C H H H H H H H H H H H H H H H H H H H H H
charge: -0.258336 0.058115 -0.412225 -0.651518 0.377916 -0.468922 -0.500337 -0.488920 0.025510 -0.428317 -0.397083 -0.418574 -0.383854 -0.541881 -0.378007 0.291816 0.180935 0.215176 0.194095 0.197735 0.210574 0.206876 0.180792 0.271692 0.207173 0.187202 0.207042 0.204072 0.201078 0.175613 0.186702 0.237300 0.204956 0.210339 0.256118 0.341398 0.297749
chargesum: 0.00000
title: Mulliken charges with hydrogens summed into heavy atoms:
elementType: O N N N C C C C C C C C C C C C
charge: -0.258336 0.058115 -0.156107 -0.012371 0.377916 -0.072812 -0.108506 -0.071470 0.025510 0.024167 -0.002708 -0.007460 -0.007163 -0.117879 0.037289 0.291816
polarizability: 1.89474858e+02 5.58489586e+00 1.56403632e+02 9.99899042e-01 -8.12452945e+00 1.17495313e+02
1716.lowfreq: -27.7952 -8.7570 -0.0005 -0.0004 -0.0001 10.8331 25.9772 40.5263 83.2919
frequency: 18.4071 40.1117 83.1512 99.5646 113.0961 129.1664 182.4703 231.1954 247.0598 251.9449 267.3904 281.1369 308.6311 345.8836 362.5790 396.0563 410.9198 438.7609 456.2458 469.2292 481.4376 504.5291 522.8193 540.8272 563.4606 600.9477 655.0557 702.6527 709.2127 772.7687 789.9851 808.5188 836.7766 849.1740 875.8239 881.6306 911.1138 923.5017 929.5897 940.7533 964.6224 996.9582 1033.7373 1038.3668 1051.3301 1063.3344 1071.9797 1099.3270 1104.0142 1106.7518 1121.4324 1131.8095 1148.3217 1152.8960 1202.1680 1226.4061 1250.6306 1260.1230 1262.4074 1271.7791 1290.6493 1306.7333 1312.6625 1318.9128 1331.5638 1338.2657 1339.8134 1342.4155 1346.5385 1353.2125 1361.7852 1446.7483 1452.6353 1459.0968 1463.1982 1466.6537 1467.8123 1475.8441 1477.1606 1480.4156 1490.6593 1598.4990 1605.5129 1677.1779 2950.9138 2954.9430 2959.6607 2962.6799 2970.5825 2973.5848 2977.8676 2980.7159 2989.0176 3018.5262 3019.9734 3023.3011 3024.6755 3031.2509 3032.5934 3035.4407 3047.3983 3066.9373 3404.9332 3537.5796 3696.3280
redmass: 4.4906 4.0019 3.7917 4.1043 3.0442 3.9063 2.7291 1.8639 2.6079 2.7061 2.3425 2.1152 2.6309 1.8323 2.1431 2.2105 2.6282 2.3863 2.9387 2.0190 1.4270 1.9925 1.8875 1.8142 2.1145 5.4151 2.9280 3.6625 8.0230 1.6064 1.7501 1.9154 2.0675 2.6715 2.0635 1.8111 1.9325 2.1333 1.5705 2.4254 2.2966 1.9620 1.8418 2.3862 2.2204 1.9834 1.7870 1.6000 2.5375 1.5466 1.9452 1.5979 1.8429 1.8429 1.7764 1.5863 1.3978 1.3158 1.3034 1.2596 2.3727 1.4866 1.4149 1.4310 1.4984 1.3819 1.4170 1.4379 1.4706 1.4231 1.4421 1.0909 1.2045 1.1045 1.0864 1.1327 1.0895 1.1478 1.1231 1.1225 1.3136 1.4817 4.0046 5.2534 1.0644 1.0637 1.0614 1.0610 1.0622 1.0586 1.0619 1.0642 1.0660 1.0974 1.0993 1.0947 1.0976 1.1006 1.1027 1.0955 1.1033 1.0986 1.0744 1.0458 1.1034
irintensity: 3.5135 14.7392 4.7216 2.7939 0.2943 1.1463 1.1517 1.9108 1.3092 2.2085 2.2697 6.6853 5.3807 0.7852 36.1877 35.2998 11.5801 2.1879 8.7796 100.4532 126.7136 0.6578 23.5530 45.5641 24.9419 4.4397 4.8161 8.6124 17.3625 1.4110 1.8941 1.4417 8.8019 2.1804 1.2603 5.7278 11.4667 6.7219 1.8321 6.6680 6.7734 6.6080 2.6898 24.0227 4.9659 2.3251 54.3890 27.8232 31.6847 11.3627 21.4060 8.2674 17.0003 11.2164 0.7638 3.0252 1.3127 4.7844 2.6632 5.4965 327.9534 15.3336 0.8289 2.5595 0.5312 0.7702 4.8785 2.0343 5.4004 1.1592 0.3913 6.4551 53.8182 21.4844 10.4037 25.7208 24.9468 100.6463 62.3890 29.3168 152.0943 132.2301 12.6816 291.1731 15.6116 44.9146 25.1554 72.0087 26.8968 14.2619 45.6403 36.0557 63.5065 79.0011 64.3368 66.1785 13.9873 36.7696 50.6625 36.0543 94.8720 34.1813 28.0187 42.4256 41.1118
temp: 298.150 k
press: 1.00000 atm
elementType: 8 7 7 7 6 6 6 6 6 6 6 6 6 6 6 6 1 1 1 1 1 1 1 1 1 1 1 1 1 1 1 1 1 1 1 1 1
symmnumber: 1
zpe: 845489.7 jmol-1
zpe.correction: 0.322030 hartree
zpe.thermalcorrener: 0.337907 hartree
zpe.thermalcorrenthalpy: 0.338851 hartree
zpe.thermalcorrgfe: 0.278553 hartree
zpe.sumelectzpe: -708.088961 hartree
zpe.sumelectthermal: -708.073085 hartree
zpe.sumelectthermalent: -708.072140 hartree
zpe.sumelectthermalfe: -708.132439 hartree
dipole: -0.3645 -5.5245 2.4100
dipole: 6.0383
quadrupole: -85.8913 -96.1023 -98.8239
quadrupole: -14.3439 7.1540 -0.7094
quadrupole: 7.7145 -2.4965 -5.2180 -14.3439 7.1540 -0.7094
hfenergy: -708.4109912 hartree
pointgroup: C01 [X(C12H21N3O1)]
dipole: 0.3527447 2.1324038 -0.9859679 debye
polarizability: 184.2090646|-13.3214756|161.0450589|-6.4282994|-7.2816717|118.119679 unknown
InChI: InChI=1S/C12H21N3O/c13-11(16)15-14-10-6-2-5-9-12(10)7-3-1-4-8-12/h15H,1-9,13H2
charge 0 multiplicity 1
37 atoms
O  3.064325 -2.109623 0.388748
N  0.991246 -0.238377 0.076651
N  2.278244 -0.013568 -0.38847
N  4.538473 -0.582955 -0.580645
C  -1.374165 0.3013 0.374528
C  -1.377018 -0.910154 1.357554
C  -2.395142 0.007385 -0.779731
C  -1.826337 1.572465 1.17539
C  0.019729 0.602028 -0.208631
C  -1.219075 -2.300875 0.697428
C  -2.144147 -1.35084 -1.473188
C  -1.732377 2.896151 0.383936
C  -2.227022 -2.51165 -0.455621
C  0.145748 1.892759 -1.016696
C  -0.306519 3.114799 -0.167765
C  3.272083 -0.989736 -0.144294
H  -2.344383 -0.877785 1.904718
H  -0.573277 -0.770591 2.104647
H  -2.393742 0.823434 -1.527713
H  -3.410652 -0.002829 -0.330001
H  -1.192756 1.648937 2.083569
H  -2.866248 1.412329 1.523422
H  -1.358884 -3.083489 1.469267
H  -0.186545 -2.400359 0.320033
H  -1.140478 -1.350874 -1.944689
H  -2.883628 -1.493957 -2.285897
H  -2.016429 3.742473 1.038963
H  -2.455384 2.891696 -0.456125
H  -2.032882 -3.478732 -0.958968
H  -3.260184 -2.560956 -0.049586
H  1.172447 2.067655 -1.393348
H  -0.49805 1.825769 -1.915922
H  0.398816 3.249611 0.676564
H  -0.263209 4.033985 -0.783386
H  2.512567 0.815385 -0.949641
H  5.292861 -1.254534 -0.4649
H  4.759595 0.357623 -0.901001
