program: Gaussian 09
title: 000285585
version: EM64L-G09RevD.01
frameworkgroup: C1[X(C10H13N3O3S)]
method: RPBEPBE
basis: SDD
operation: Freq
keyword: #p
keyword: freq=noraman
keyword: PBEPBE/SDD
title: #p freq=noraman PBEPBE/SDD
converged: YES YES NO NO
title: Mulliken charges:
elementType: S O O O N N N C C C C C C C C C C H H H H H H H H H H H H H
charge: 0.341645 -0.185372 -0.214031 -0.223333 -0.382380 0.083924 0.077872 0.117383 -0.686562 -0.686166 -0.687562 0.230009 -0.070725 -0.274188 -0.239680 -0.077585 -0.211737 0.239005 0.191815 0.227706 0.200291 0.234060 0.232896 0.228019 0.238938 0.191051 0.282647 0.222131 0.302775 0.297154
chargesum: 0.00000
title: Mulliken charges with hydrogens summed into heavy atoms:
elementType: S O O O N N N C C C C C C C C C C
charge: 0.341645 -0.185372 -0.214031 -0.223333 -0.099732 0.083924 0.077872 0.117383 -0.028037 -0.018918 -0.029554 0.230009 -0.070725 -0.052057 0.063095 -0.077585 0.085416
polarizability: 3.93663784e+02 -4.29986118e+00 1.57562301e+02 8.92636984e-02 5.91466544e-03 8.43734395e+01
1716.lowfreq: -8.5420 -2.8116 -2.1539 -0.0015 -0.0009 0.0012 7.2010 30.8542 41.6868
frequency: 1.5840 30.8015 41.6700 45.2637 86.3516 100.6370 126.3230 156.9250 173.5267 187.4957 211.5625 222.9890 235.3020 243.5678 275.3977 280.3210 334.1886 337.2547 344.7388 370.5294 398.4869 418.4934 470.7540 471.9375 498.7142 570.0430 581.4007 608.7972 639.8108 671.6561 701.1412 715.6152 731.5064 780.4878 807.6965 839.0907 913.2293 915.1990 927.2711 934.1184 946.2672 948.7423 1005.2646 1011.8421 1017.5030 1055.6901 1083.8848 1123.5191 1164.7203 1206.3381 1222.9407 1226.2227 1240.9797 1253.1573 1333.5187 1343.2653 1360.9339 1379.2308 1382.4703 1407.9338 1453.3108 1454.2424 1460.8912 1462.3539 1477.2879 1480.2372 1489.6425 1502.7270 1526.3004 1554.3184 1639.6933 2972.0910 2975.0943 2991.3022 2994.0532 3062.6106 3067.6633 3083.0117 3085.3707 3093.8058 3103.2687 3194.3289 3213.0406 3377.5032
redmass: 3.3450 5.8151 6.2636 7.3652 7.3138 9.4001 5.8490 7.0717 1.1055 3.3232 2.8995 5.1690 1.3331 1.1176 3.3960 2.5802 4.4714 3.2202 4.2007 2.4743 7.1225 4.6233 4.5282 11.4232 4.8813 3.4093 3.4562 9.7156 1.2326 10.5639 6.3855 7.2354 11.4724 5.4158 3.3147 1.2819 3.7975 1.5095 1.6895 1.6234 1.3986 1.2098 2.1097 1.7319 1.4218 2.9633 3.9718 2.7004 2.9445 2.9473 2.3511 2.1954 3.5247 3.0091 6.1190 1.7158 4.8979 1.1747 1.1976 1.2090 1.0504 2.9535 1.0831 1.0496 1.0513 1.2097 1.0834 1.9398 5.5564 4.6414 7.6591 1.0360 1.0359 1.0874 1.0361 1.0984 1.0980 1.1009 1.1004 1.0997 1.0998 1.0922 1.1004 1.0748
irintensity: 0.2745 0.1999 3.3236 11.0361 0.0130 0.5873 2.4472 0.9228 0.1071 0.4304 17.7694 1.7098 8.5196 0.4897 9.1382 2.2099 2.0106 12.1541 0.3799 0.2912 0.0185 0.8443 6.1523 1.4369 0.8818 5.7004 1.2106 5.9086 75.4738 19.9984 1.7286 2.5639 4.7221 6.2588 1.6834 48.3795 65.1022 32.4415 3.4798 5.7088 0.0038 0.8248 31.0249 92.5317 0.4768 1.3080 192.6964 375.0413 564.0426 8.3367 34.5857 10.5788 589.6751 0.9670 125.4748 0.2339 53.4407 15.6581 18.7282 55.8004 1.8662 417.9680 17.7099 1.7275 13.0291 6.3623 33.1713 190.0640 82.6695 12.4948 176.9030 22.3717 30.2409 42.1539 28.6392 5.9171 117.2112 10.4577 11.8296 61.0036 26.3819 0.0273 3.1673 0.5121
temp: 298.150 k
press: 1.00000 atm
elementType: 16 8 8 8 7 7 7 6 6 6 6 6 6 6 6 6 6 1 1 1 1 1 1 1 1 1 1 1 1 1
symmnumber: 1
zpe: 585156.0 jmol-1
zpe.correction: 0.222874 hartree
zpe.thermalcorrener: 0.240953 hartree
zpe.thermalcorrenthalpy: 0.241897 hartree
zpe.thermalcorrgfe: 0.172432 hartree
zpe.sumelectzpe: -1175.447777 hartree
zpe.sumelectthermal: -1175.429697 hartree
zpe.sumelectthermalent: -1175.428753 hartree
zpe.sumelectthermalfe: -1175.498219 hartree
dipole: -7.9239 -3.4135 0.0033
dipole: 8.6279
quadrupole: -137.6374 -108.9645 -107.1782
quadrupole: 18.1996 -0.0372 0.0267
quadrupole: -19.7107 8.9622 10.7485 18.1996 -0.0372 0.0267
hfenergy: -1175.6706507 hartree
pointgroup: C01 [X(C10H13N3O3S1)]
dipole: 3.1134476 1.3523427 -0.008547 debye
polarizability: 393.6874091|-3.5881014|157.5358133|-0.2413255|-0.4416039|84.3763023 unknown
InChI: InChI=1S/C10H13N3O3S/c1-10(2,3)9(14)12-11-6-7-4-5-8(17-7)13(15)16/h4-6,12H,1-3H3
charge 0 multiplicity 1
30 atoms
S  -2.833454 1.309452 -0.008534
O  3.24136 -1.711739 0.002864
O  -6.112288 -0.969139 0.009656
O  -5.794456 1.309965 -0.005022
N  2.204737 0.384802 -0.007054
N  0.939891 -0.14285 -0.003073
N  -5.357407 0.085297 0.001916
C  4.69549 0.308557 -0.005049
C  4.804719 1.184104 1.279677
C  5.841358 -0.731096 -0.018446
C  4.795001 1.205912 -1.275172
C  3.346681 -0.463434 -0.003423
C  -1.427837 0.168007 -0.002809
C  -0.08133 0.698748 -0.007642
C  -1.844442 -1.17481 0.006247
C  -3.93561 -0.113269 0.001702
C  -3.258049 -1.333289 0.008745
H  4.694623 0.568748 2.190425
H  4.046664 1.989505 1.31751
H  5.799014 1.665386 1.311045
H  6.816011 -0.210009 -0.016257
H  5.788995 -1.391598 0.863469
H  5.784134 -1.374289 -0.912898
H  5.790445 1.68474 -1.307285
H  4.674683 0.607145 -2.195639
H  4.039981 2.014966 -1.292018
H  2.347699 1.406686 -0.013775
H  0.04211 1.799451 -0.014444
H  -1.12534 -1.995989 0.010672
H  -3.783083 -2.289758 0.015409
