program: Gaussian 09
title: 000285593
version: EM64L-G09RevD.01
frameworkgroup: C1[X(C14H14N2O)]
method: RPBEPBE
basis: SDD
operation: Freq
keyword: #p
keyword: freq=noraman
keyword: PBEPBE/SDD
title: #p freq=noraman PBEPBE/SDD
converged: YES YES NO NO
title: Mulliken charges:
elementType: O N N C C C C C C C C C C C C C C H H H H H H H H H H H H H H
charge: -0.262956 -0.450079 -0.703534 -0.663434 0.471517 -0.579315 0.179608 -0.460937 0.505247 0.468634 -0.195331 -0.430344 -0.447093 -0.350562 -0.198281 -0.214847 -0.256403 0.248318 0.248064 0.231762 0.247557 0.340042 0.223843 0.219991 0.225362 0.307893 0.224263 0.225116 0.226929 0.310940 0.308031
chargesum: 0.00000
title: Mulliken charges with hydrogens summed into heavy atoms:
elementType: O N N C C C C C C C C C C C C C C
charge: -0.262956 -0.110038 -0.084562 -0.167052 0.471517 -0.347553 0.179608 -0.213380 0.505247 0.468634 0.028512 -0.210353 -0.221731 -0.042669 0.025982 0.010270 -0.029475
polarizability: 2.08793644e+02 9.49703541e+00 1.71744933e+02 -7.13768430e-01 8.51497041e+00 1.28996430e+02
1716.lowfreq: -6.1704 -2.0783 0.0008 0.0008 0.0010 10.6880 20.0254 21.6873 47.7769
frequency: 19.8562 21.3089 47.7703 65.6966 85.7617 144.6976 209.1443 217.1399 251.1523 275.3896 320.8532 355.3569 383.3938 390.3788 407.7740 408.7940 431.4227 476.6278 504.4909 526.4443 564.8799 583.6786 613.2966 625.7062 676.0483 693.4641 701.3140 708.5359 758.4936 770.5929 794.7377 840.1003 846.1640 873.7679 875.9321 910.0148 919.2843 925.6953 956.7899 966.8936 973.0643 981.3637 984.7199 1000.1038 1026.7004 1039.0803 1087.8259 1100.5119 1165.4921 1171.2024 1180.0537 1184.2883 1186.1503 1192.3114 1262.1227 1280.7292 1315.3005 1321.2796 1334.7636 1385.2691 1392.7204 1430.1663 1450.1448 1466.5916 1486.0842 1492.5615 1516.5370 1589.6883 1599.1947 1613.5215 1618.0205 1628.2332 1645.4491 3001.9908 3067.3972 3112.9386 3113.8311 3119.7696 3130.5140 3131.1120 3142.9658 3154.5063 3163.6073 3192.7767 3463.8854 3566.7834 3706.7840
redmass: 3.9787 4.7061 4.9050 5.7037 4.8841 5.2416 4.8083 3.6759 4.1903 2.2402 8.1029 5.9197 1.1567 1.0995 2.7410 2.4993 3.6966 4.0080 3.0330 6.1307 4.2356 4.1335 6.3479 5.7880 3.9736 1.4291 1.8695 1.7046 3.6944 1.7054 1.6685 3.9491 1.2671 1.6346 1.6611 2.3996 1.4417 4.2946 2.3978 1.3235 1.3494 5.6254 6.1871 1.3066 2.1156 1.5758 1.5453 1.5077 1.4308 1.0523 1.1177 1.6399 1.1481 2.1293 2.0925 1.4275 1.4092 1.4340 2.4624 6.6901 7.3671 2.3041 1.1209 3.3852 2.3679 2.8592 2.1123 6.2570 5.9357 4.9614 6.3495 4.0054 1.2914 1.0630 1.0977 1.0880 1.0908 1.0863 1.0870 1.0914 1.0936 1.0994 1.0998 1.0952 1.0765 1.0450 1.1040
irintensity: 1.3632 1.0625 0.3131 5.1086 0.2926 0.5764 13.9542 0.3899 1.6507 2.2149 2.3570 0.9329 196.9303 111.3134 0.4442 1.1823 1.4059 19.3048 18.9562 0.3014 8.8490 3.3321 0.5354 0.4431 1.3252 9.2053 57.9383 28.0340 13.7570 88.7666 42.8385 3.7315 0.0893 4.6257 16.8319 0.2192 12.9936 12.9892 4.5024 2.7955 0.0800 9.3263 0.3642 2.9444 5.5487 3.4915 20.7053 8.6769 25.6102 0.8657 10.0600 8.0702 0.7012 37.2283 23.6984 14.2199 7.0699 37.0983 33.7070 50.1354 16.1033 88.5377 13.4479 25.9995 58.0877 39.5218 420.6694 47.5751 53.6229 130.4752 201.5235 54.2505 239.2128 14.0288 5.0603 12.9017 12.1089 9.0214 1.0683 21.2844 32.8238 19.5371 26.3712 7.4539 104.2045 70.2876 21.3347
temp: 298.150 k
press: 1.00000 atm
elementType: 8 7 7 6 6 6 6 6 6 6 6 6 6 6 6 6 6 1 1 1 1 1 1 1 1 1 1 1 1 1 1
symmnumber: 1
zpe: 653872.5 jmol-1
zpe.correction: 0.249047 hartree
zpe.thermalcorrener: 0.264055 hartree
zpe.thermalcorrenthalpy: 0.264999 hartree
zpe.thermalcorrgfe: 0.204623 hartree
zpe.sumelectzpe: -725.441716 hartree
zpe.sumelectthermal: -725.426708 hartree
zpe.sumelectthermalent: -725.425764 hartree
zpe.sumelectthermalfe: -725.486140 hartree
dipole: -3.8401 -3.8697 0.7740
dipole: 5.5064
quadrupole: -87.5631 -101.3339 -92.6831
quadrupole: 1.8183 -7.9059 -1.2923
quadrupole: 6.2969 -7.4739 1.1769 1.8183 -7.9059 -1.2923
hfenergy: -725.6907632 hartree
pointgroup: C01 [X(C14H14N2O1)]
dipole: -1.3625995 -1.5239506 -0.7169802 debye
polarizability: 205.7103123|17.4001695|147.0908624|-0.2675534|21.6099395|156.7338325 unknown
InChI: InChI=1S/C14H14N2O/c15-12-6-4-5-11(9-12)10-14(17)16-13-7-2-1-3-8-13/h1-9,16H,10,15H2
charge 0 multiplicity 1
31 atoms
O  1.112607 1.901213 2.172549
N  0.776649 0.580469 0.255813
N  -3.680285 -2.716585 1.02889
C  -1.186647 1.590922 1.383908
C  -2.050678 0.62702 0.587389
C  -2.479688 -0.586733 1.172774
C  0.346055 1.364116 1.318215
C  -2.403765 0.915609 -0.758785
C  -3.260326 -1.525183 0.438301
C  2.104833 0.222113 -0.110446
C  -3.179595 -0.012391 -1.493365
C  -3.606229 -1.221873 -0.91255
C  2.263126 -0.602147 -1.258434
C  3.251277 0.650053 0.612509
C  3.549173 -0.993916 -1.680619
C  4.5322 0.247986 0.175217
C  4.694619 -0.570846 -0.965728
H  -1.354844 2.632359 1.047935
H  -1.43948 1.567551 2.458408
H  -2.207047 -0.808684 2.212978
H  -2.094733 1.862831 -1.215415
H  0.028674 0.204606 -0.338112
H  -3.460079 0.21335 -2.528601
H  -4.20983 -1.930723 -1.492565
H  1.378146 -0.933883 -1.816979
H  3.121921 1.281411 1.493363
H  3.656113 -1.628803 -2.567271
H  5.412366 0.581575 0.73669
H  5.694511 -0.874767 -1.293463
H  -3.435267 -2.937838 1.98943
H  -4.242174 -3.38511 0.510469
