program: Gaussian 09
title: 000285618
version: EM64L-G09RevD.01
frameworkgroup: C1[X(C13H18N2O5S2)]
method: RPBEPBE
basis: SDD
operation: Freq
keyword: #p
keyword: freq=noraman
keyword: PBEPBE/SDD
title: #p freq=noraman PBEPBE/SDD
converged: YES YES NO NO
title: Mulliken charges:
elementType: S S O O O O O N N C C C C C C C C C C C C C H H H H H H H H H H H H H H H H H H
charge: 1.001747 0.176684 -0.449428 -0.480693 -0.546823 -0.302655 -0.206606 -0.430203 -0.681306 -0.134388 -0.362432 -0.681048 -0.054386 0.140867 0.394748 -0.184290 -0.254673 0.455140 -0.350878 -0.395373 -0.799454 -0.841651 0.305389 0.275987 0.248950 0.257104 0.261996 0.342478 0.339583 0.306314 0.291358 0.245542 0.245326 0.237015 0.240662 0.228196 0.256353 0.252920 0.257535 0.394392
chargesum: 0.00000
title: Mulliken charges with hydrogens summed into heavy atoms:
elementType: S S O O O O O N N C C C C C C C C C C C C C
charge: 1.001747 0.176684 -0.055035 -0.480693 -0.546823 -0.302655 -0.206606 -0.087725 -0.341723 0.171000 0.162506 -0.161947 -0.054386 0.140867 0.394748 0.122024 0.036685 0.455140 -0.105336 -0.150048 -0.093582 -0.074842
polarizability: 2.66819391e+02 -2.70726069e+01 1.88206885e+02 3.11274890e+00 -1.50702262e+01 1.97988953e+02
1716.lowfreq: -8.3858 -4.4521 -0.0016 0.0005 0.0011 4.2427 14.2752 15.6618 24.5224
frequency: 13.8231 15.3274 24.1851 31.7218 32.9897 43.7848 47.4300 61.7081 68.2065 86.1861 93.8276 106.9635 120.1268 133.9168 142.8635 158.1257 190.2104 195.7235 202.1991 229.3343 248.2047 264.9389 280.5725 302.8330 314.1930 317.8706 348.6489 383.5736 397.7562 407.7461 421.7003 449.0870 498.3562 526.8117 536.1196 554.6401 583.9090 617.7593 620.7653 659.7742 664.7906 689.9000 704.7488 705.9178 730.7126 758.4197 776.1318 789.4829 816.3210 824.9795 836.8451 842.2032 901.9994 956.6078 958.9531 962.5084 979.2122 980.2272 986.3117 992.5442 996.9481 1006.4797 1050.4183 1050.6961 1068.0837 1075.6420 1114.9205 1123.0661 1167.0057 1180.6161 1188.9722 1218.4307 1221.0996 1261.7647 1276.7722 1285.0974 1300.9325 1314.3126 1342.8907 1352.0659 1359.3307 1382.1535 1392.0008 1403.5791 1449.9198 1454.6889 1461.3254 1468.7634 1469.0247 1470.7206 1472.3984 1476.6186 1592.0349 1595.6257 1603.6946 1679.1774 2983.4190 2996.3561 3000.4252 3009.5419 3020.1601 3063.1022 3063.8032 3090.2104 3092.3968 3112.2066 3129.9173 3139.1857 3141.2188 3165.1527 3185.9468 3498.1450 3527.1013 3554.3731
redmass: 6.3905 4.9426 3.8312 1.4932 2.3144 5.1613 6.9611 7.3016 4.8991 5.5630 3.2484 3.8237 6.4241 6.5877 4.2421 1.0949 6.2736 6.0655 4.8671 8.5666 6.6406 6.2557 3.8755 5.3136 4.2355 4.2234 1.2952 3.8440 6.1735 2.8907 9.1448 4.3552 2.9258 2.6985 3.5681 1.5293 5.5311 1.6709 6.4114 5.3657 6.2035 4.2154 9.4785 3.2905 5.3055 2.5334 4.9514 1.5881 5.7989 1.5849 3.6028 1.2489 3.0076 1.3335 3.3513 1.6465 1.4479 1.3883 2.6410 1.9864 1.9924 2.6876 1.6433 2.3133 2.8275 1.8502 2.3760 1.3279 1.2551 1.9369 1.1470 3.0815 1.2855 1.2819 1.3992 1.2048 1.2560 1.7298 1.2303 1.6633 1.4740 5.3833 2.7192 1.3149 1.0538 1.0902 1.0685 1.9507 1.1056 1.0489 2.2608 1.1122 6.2704 6.5377 7.2626 9.1724 1.0376 1.0545 1.0314 1.0736 1.0688 1.0973 1.1049 1.1058 1.0992 1.1058 1.1022 1.0901 1.0896 1.0961 1.0952 1.0789 1.0644 1.0782
irintensity: 0.8350 1.6402 0.3007 2.2417 1.1042 2.7783 1.7512 1.7580 0.9989 1.1813 0.4827 4.3129 2.9741 1.4002 7.1707 0.4039 7.4109 4.8670 3.6124 7.5944 7.8459 1.5428 8.0777 4.3761 5.8193 6.2741 9.1736 2.2285 35.1895 0.5778 50.9368 69.1164 18.9542 136.2223 43.4704 101.9029 13.7449 168.4063 7.8069 98.3917 32.4501 49.6986 64.1386 2.2470 53.5617 4.7953 12.4061 32.8308 122.4885 25.5654 10.6366 6.7711 11.0251 1.5158 28.0461 52.6743 35.5288 2.1014 1.7636 52.9944 13.4621 55.1513 13.2199 30.2349 94.6478 88.9093 5.9878 9.8202 14.8936 125.6076 5.6979 3.1769 2.5159 9.2309 3.3517 3.3526 4.0132 95.2479 13.3470 116.5010 68.2978 4.7700 13.4936 14.9935 14.7168 9.8228 30.4175 632.4996 25.6106 21.0716 32.2543 17.9992 23.9718 0.7960 122.8059 213.8204 24.0335 29.4484 31.1606 10.6090 12.0645 15.2416 10.3655 24.0241 17.3505 21.8356 11.0256 14.2257 6.2618 6.6711 8.2528 27.1748 35.0954 83.3122
temp: 298.150 k
press: 1.00000 atm
elementType: 16 16 8 8 8 8 8 7 7 6 6 6 6 6 6 6 6 6 6 6 6 6 1 1 1 1 1 1 1 1 1 1 1 1 1 1 1 1 1 1
symmnumber: 1
zpe: 787697.0 jmol-1
zpe.correction: 0.300018 hartree
zpe.thermalcorrener: 0.325524 hartree
zpe.thermalcorrenthalpy: 0.326469 hartree
zpe.thermalcorrgfe: 0.238931 hartree
zpe.sumelectzpe: -1786.103076 hartree
zpe.sumelectthermal: -1786.077569 hartree
zpe.sumelectthermalent: -1786.076625 hartree
zpe.sumelectthermalfe: -1786.164163 hartree
dipole: -1.0044 4.1871 3.4718
dipole: 5.5312
quadrupole: -116.1922 -161.2532 -138.6536
quadrupole: -22.1151 23.4943 4.5054
quadrupole: 22.5074 -22.5535 0.0461 -22.1151 23.4943 4.5054
hfenergy: -1786.4030935 hartree
pointgroup: C01 [X(C13H18N2O5S2)]
dipole: -0.3600939 1.6727515 1.3445786 debye
polarizability: 266.8020606|-27.5555267|187.8111619|2.0008412|-14.2679589|198.4020063 unknown
InChI: InChI=1S/C13H18N2O5S2/c1-9-3-5-10(6-4-9)22(19,20)15-13(18)14-11(12(16)17)7-8-21-2/h3-6,11,14-16H,7-8H2,1-2H3
charge 0 multiplicity 1
40 atoms
S  -1.601139 -1.794227 1.042945
S  5.445641 -1.215059 -1.454233
O  3.409618 2.107584 2.314237
O  -1.115787 -2.826451 -0.09978
O  -2.037908 -2.322088 2.51868
O  0.148399 0.167513 -0.650028
O  4.030845 3.36456 0.459591
N  1.72304 0.583643 1.024177
N  -0.212363 -0.656753 1.5134
C  2.531149 1.434976 0.140417
C  3.435727 0.627656 -0.848908
C  4.446786 -0.28644 -0.140425
C  -2.943893 -0.65876 0.374132
C  3.384882 2.413912 0.939668
C  0.540953 0.032582 0.549243
C  -2.895541 -0.267053 -0.973121
C  -3.968857 -0.303041 1.2632
C  -5.017539 0.939825 -0.592146
C  -3.951268 0.540734 -1.444543
C  -5.010985 0.507962 0.759709
C  -6.14368 1.803899 -1.128465
C  6.444133 -2.327367 -0.311578
H  1.844259 2.033595 -0.489031
H  2.759983 0.029397 -1.485145
H  3.961316 1.354281 -1.495891
H  5.15478 0.290414 0.482579
H  3.928844 -1.032151 0.488005
H  2.004847 0.516325 2.003453
H  0.103664 -0.848961 2.471368
H  -2.059024 -0.562819 -1.611108
H  -3.958711 -0.660536 2.297758
H  -3.943249 0.869499 -2.490037
H  -5.828631 0.802536 1.426747
H  -5.752096 2.72617 -1.595515
H  -6.720097 1.267292 -1.90537
H  -6.846964 2.098715 -0.331674
H  7.087337 -2.944607 -0.957943
H  7.073032 -1.723469 0.36249
H  5.773807 -2.980585 0.270007
H  3.990191 2.7581 2.793027
