program: Gaussian 09
title: 000024023
version: EM64L-G09RevD.01
frameworkgroup: C1[X(C13H8Cl4)]
method: RPBEPBE
basis: SDD
operation: Freq
keyword: #pfreq=noraman
keyword: PBEPBE/SDD
title: #p freq=noraman PBEPBE/SDD
converged: YES YES NO NO
title: Mulliken charges:
elementType: Cl Cl Cl Cl C C C C C C C C C C C C C H H H H H H H H
charge: 0.012509 0.012658 -0.038341 -0.038355 -0.807391 0.602244 0.600620 -0.332506 -0.330940 -0.365245 -0.366992 -0.211341 -0.211645 -0.200914 -0.200573 -0.123096 -0.123173 0.270301 0.270453 0.267639 0.267590 0.262168 0.262189 0.261074 0.261067
chargesum: 0.00000
title: Mulliken charges with hydrogens summed into heavy atoms:
elementType: Cl Cl Cl Cl C C C C C C C C C C C C C
charge: 0.012509 0.012658 -0.038341 -0.038355 -0.807391 0.602244 0.600620 -0.062204 -0.060487 -0.097606 -0.099402 0.050827 0.050543 0.060160 0.060495 -0.123096 -0.123173
polarizability: 2.54727246e+02 9.28973402e-02 1.68889172e+02 1.79733475e+01 -7.43598471e-02 1.22954660e+02
1716.lowfreq: -0.0017 -0.0008 -0.0008 4.2221 6.7401 7.6888 21.2647 33.1319 56.0255
frequency: 20.4271 33.1254 56.0250 59.1146 117.3820 145.6516 160.8124 184.2422 198.8646 218.2980 240.4491 285.1814 320.6228 343.6199 344.1540 364.7636 403.5521 410.0471 415.4807 462.2483 501.5019 518.3369 617.3636 623.0910 658.5986 681.2815 685.2734 721.3608 740.2805 809.0620 829.8800 835.6258 845.2360 861.3219 880.5890 962.9430 965.9690 976.6410 978.7010 1000.0691 1000.4474 1076.9168 1077.6989 1118.0875 1121.0815 1164.2896 1192.6761 1194.9426 1244.4134 1296.7001 1299.0829 1359.6460 1367.5654 1394.6182 1397.3323 1471.6227 1475.9473 1576.8466 1580.1740 1594.8139 1595.1421 3151.3764 3152.3494 3163.4259 3163.8413 3175.1392 3175.2858 3182.0251 3182.4384
redmass: 4.1312 12.2081 4.4959 15.4410 11.1415 10.1850 13.3326 14.6505 20.7644 10.6638 12.7332 12.0634 5.2885 5.8320 8.0945 7.0453 2.9310 2.9514 9.5253 8.2191 3.5833 3.2433 6.7530 7.0415 6.0940 7.1101 6.6545 4.3219 3.5941 2.7374 1.2999 1.2525 1.6150 2.1722 5.6511 1.3604 1.3467 1.3646 1.3667 4.0622 4.2151 2.9880 2.7267 1.3693 1.3457 3.5437 1.1233 1.1358 4.1884 1.2614 1.2532 5.3048 5.8551 3.8426 3.6487 2.2718 2.3755 7.4306 7.5754 6.4223 6.2251 1.0892 1.0887 1.0886 1.0886 1.0965 1.0964 1.0971 1.0971
irintensity: 0.0801 0.0292 0.0186 0.9682 0.0045 0.8587 1.4759 2.8921 0.6050 1.4119 3.1037 0.0985 1.4592 3.1141 17.3877 13.7018 0.8866 0.0009 26.2470 17.2495 33.4685 4.5322 18.7149 1.9848 56.6131 41.5212 8.7929 1.5207 93.2690 144.7640 4.7158 0.3078 37.7835 0.2886 72.4034 0.5183 0.5534 0.3089 0.0011 60.4611 11.8199 28.7900 78.4170 8.0474 1.4499 25.0698 13.6333 0.1289 122.6617 5.0445 0.4976 12.6869 2.5740 15.1796 13.4315 21.9851 76.7976 3.4452 18.4283 19.5929 78.4756 7.1853 0.1278 0.2747 0.2450 3.0699 2.2235 2.0560 0.8356
temp: 298.150 k
press: 1.00000 atm
elementType: 17 17 17 17 6 6 6 6 6 6 6 6 6 6 6 6 6 1 1 1 1 1 1 1 1
symmnumber: 1
zpe: 439167.7 jmol-1
zpe.correction: 0.167270 hartree
zpe.thermalcorrener: 0.182930 hartree
zpe.thermalcorrenthalpy: 0.183874 hartree
zpe.thermalcorrgfe: 0.121401 hartree
zpe.sumelectzpe: -2339.235950 hartree
zpe.sumelectthermal: -2339.220291 hartree
zpe.sumelectthermalent: -2339.219346 hartree
zpe.sumelectthermalfe: -2339.281820 hartree
dipole: 0.0050 -1.0609 -0.0102
dipole: 1.0610
quadrupole: -133.2306 -129.0116 -123.8279
quadrupole: 0.0627 5.9999 -0.0254
quadrupole: -4.5405 -0.3216 4.8621 0.0627 5.9999 -0.0254
hfenergy: -2339.4032202 hartree
pointgroup: C01 [X(C13H8Cl4)]
dipole: 0.0108673 0.4119291 0.0666101 debye
dipolederiv: -0.3591006 -0.0284123 -0.0318218 -0.2017619 -0.6248258 0.2743528 0.1137185 0.3405453 -0.448464 -0.3513103 0.0304655 -0.0352732 0.1496374 -0.4399899 -0.2683709 0.1514182 -0.3430608 -0.6427757 -0.7726309 -0.3403322 -0.0509385 -0.3932894 -0.281351 -0.0609063 -0.0669738 -0.064217 -0.0972286 -0.7411137 0.3583354 0.0557466 0.4132463 -0.3307059 -0.0062869 0.0557809 -0.0024816 -0.0790678 1.367327 -0.0158946 0.0943524 -0.0007685 1.228095 0.0015441 0.0076333 0.0045149 1.1997995 -0.3661451 -0.0803672 -0.002276 0.061677 -0.1632847 -0.0132405 -0.189576 -0.140093 -0.2069842 -0.3616515 0.0842565 0.0238129 0.0032784 -0.2126284 0.0118782 -0.192767 0.147131 -0.1587918 0.0167524 -0.0444586 -0.0962904 0.1504577 0.0155774 0.0457707 0.03976 0.1143941 -0.0094606 0.0121254 0.0714324 -0.0801847 -0.1530784 0.0604373 -0.0201775 -0.0104819 -0.0943968 -0.0501842 0.0853542 0.1334131 0.0324206 -0.0673547 -0.0230552 0.0830761 -0.0966221 0.0486555 -0.0269051 0.0832051 -0.140178 -0.0125389 0.089027 0.0134081 -0.0721699 -0.0755224 -0.0321028 -0.0626861 -0.4131415 -0.0986449 0.0323681 -0.1093479 -0.0800377 0.0550312 0.0527151 0.067536 -0.0375528 -0.4028913 0.098574 0.0599419 0.1040688 -0.0500752 -0.0601957 0.0811927 -0.0727715 -0.0763313 -0.2350802 -0.1735904 -0.1250849 -0.221882 -0.2192519 -0.0268159 -0.1490036 -0.0483624 -0.0565184 -0.218334 0.2014367 -0.0690285 0.2542854 -0.2447471 -0.0242072 -0.078212 -0.0012103 -0.0471417 1.1039318 0.5390762 0.0507652 0.5993255 0.3510349 0.1594971 0.0763244 0.1658843 0.0731858 1.055675 -0.5571205 -0.1187366 -0.6216981 0.4634886 -0.0455126 -0.1114339 -0.0533062 0.0083679 0.0199321 0.0135278 0.0772513 0.0365118 0.0864303 -0.0169183 0.1204586 -0.0291751 0.0726903 0.0171212 -0.0324195 0.0712501 -0.0664047 0.0769816 0.014314 0.1069416 0.0247182 0.0848461 0.1442908 -0.02581 -0.0152395 -0.0035041 0.0638837 -0.0680448 0.0077403 -0.0626534 0.0736736 0.1458341 0.0245941 -0.0052697 -0.0035525 0.0280217 0.0552256 0.0100779 0.0480544 0.1091551 0.0851419 -0.0310277 -0.0034935 -0.033204 0.056601 -0.093639 -0.0009328 -0.0905359 0.0670174 0.0877054 0.0283268 0.0089917 0.0292928 0.0042502 0.0747491 0.0116954 0.0716476 0.1168521 -0.0014334 0.003755 0.0700807 0.002094 0.1236956 -0.0413446 0.0681361 -0.0462822 0.0843472 -0.001564 -0.0189376 0.0691946 -0.017056 0.0980474 0.0423913 0.0679323 0.0475676 0.1101575 unknown
polarizability: 254.6710037|0.8019923|167.8040652|-18.1037166|7.1190578|124.0960085 unknown
InChI: InChI=1S/C13H8Cl4/c14-11-5-1-9(2-6-11)13(16,17)10-3-7-12(15)8-4-10/h1-8H
charge 0 multiplicity 1
25 atoms
Cl 0.088491 -2.70526 1.10252
Cl -0.191173 -2.234505 -1.890129
Cl 5.286331 1.745352 0.35491
Cl -5.203837 1.993664 0.182644
C  -0.026156 -1.306969 -0.21297
C  1.283323 -0.542014 -0.145733
C  -1.301221 -0.501736 -0.038376
C  1.413378 0.483883 0.830627
C  -1.385839 0.767191 -0.675277
C  2.402917 -0.867533 -0.949274
C  -2.433945 -0.998156 0.650951
C  2.62684 1.182592 0.988254
C  -2.568126 1.5310 -0.611948
C  3.623003 -0.173916 -0.80413
C  -3.623058 -0.242048 0.725497
C  3.71755 0.844085 0.163302
C  -3.673517 1.01377 0.092144
H  0.566763 0.734539 1.477295
H  -0.528496 1.158002 -1.231999
H  2.320783 -1.66146 -1.696235
H  -2.386193 -1.976053 1.137069
H  2.72287 1.970602 1.74037
H  -2.629534 2.505605 -1.10412
H  4.482762 -0.423898 -1.431934
H  -4.493116 -0.626035 1.265243
