program: Gaussian 09
title: 000285541
version: EM64L-G09RevD.01
frameworkgroup: C1[X(C10H4BrF4N)]
method: RPBEPBE
basis: SDD
operation: Freq
keyword: #p
keyword: freq=noraman
keyword: PBEPBE/SDD
title: #p freq=noraman PBEPBE/SDD
converged: NO NO NO NO
title: Mulliken charges:
elementType: Br F F F F N C C C C C C C C C C H H H H
charge: 0.059295 -0.163913 -0.163858 -0.130401 -0.186374 0.013794 0.516787 -0.126207 0.022295 -0.235937 -0.232003 -0.488721 -0.266336 0.299064 0.329069 -0.362007 0.280419 0.279857 0.283608 0.271569
chargesum: 0.00000
title: Mulliken charges with hydrogens summed into heavy atoms:
elementType: Br F F F F N C C C C C C C C C C
charge: 0.059295 -0.163913 -0.163858 -0.130401 -0.186374 0.013794 0.516787 -0.126207 0.022295 -0.235937 0.048416 -0.208864 0.017272 0.299064 0.329069 -0.090438
polarizability: 1.82033120e+02 1.17273203e+01 1.70523020e+02 1.06387324e-02 -2.91189608e-03 5.50651810e+01
1716.lowfreq: -23.1025 -6.3986 -6.1173 0.0004 0.0009 0.0010 5.6883 57.9184 99.3337
frequency: -23.0583 57.9108 99.3320 110.4764 133.5298 155.2103 195.4235 246.8607 255.3093 274.1677 302.1352 384.7863 392.7237 420.2344 452.0176 481.7396 485.8105 525.2427 535.6871 549.3988 625.0756 626.3357 680.1616 687.2885 764.2053 773.0257 796.3611 839.1833 877.6570 886.3832 900.5378 964.7045 974.4143 984.7852 1048.6877 1069.1371 1118.5431 1142.2228 1188.6950 1246.9086 1282.9861 1292.5619 1330.1253 1376.9889 1403.6877 1458.6215 1489.2000 1550.1141 1577.7250 1628.3230 3169.2418 3175.1982 3185.3312 3188.5508
redmass: 17.6933 10.5121 6.9934 18.2625 16.5231 6.4060 6.3008 21.2066 14.3770 10.1587 12.4224 9.3098 9.0202 3.6649 8.8010 9.1050 9.7158 7.2701 3.6609 7.7213 6.5829 13.1818 8.2273 4.4053 10.4564 2.8395 6.6311 1.6563 1.5637 1.5080 7.5100 3.6966 1.3516 11.2954 7.8389 5.3505 1.6181 1.7086 2.2040 1.5802 3.1382 6.5252 4.0599 4.9185 5.5553 4.3851 4.3818 8.7639 9.1151 7.1611 1.0888 1.0925 1.0942 1.0988
irintensity: 0.1071 0.6064 0.1051 0.6668 0.0598 0.8820 4.5182 1.0244 3.2898 1.5477 4.4528 0.0957 0.0715 9.2191 4.6336 0.5001 25.6682 2.0019 1.6959 0.8717 5.9432 24.8425 20.5159 0.4354 29.2473 2.4465 16.4688 37.4926 3.7742 55.8205 81.5165 4.7111 1.8617 241.6964 204.2329 109.4434 10.6508 39.7048 180.9400 28.5319 80.7689 55.8831 42.7672 5.3914 44.9057 63.1259 142.5606 13.2775 14.1108 47.8729 0.0967 2.6273 1.3683 1.8963
temp: 298.150 k
press: 1.00000 atm
elementType: 35 9 9 9 9 7 6 6 6 6 6 6 6 6 6 6 1 1 1 1
symmnumber: 1
zpe: 307206.8 jmol-1
zpe.correction: 0.117009 hartree
zpe.thermalcorrener: 0.129438 hartree
zpe.thermalcorrenthalpy: 0.130382 hartree
zpe.thermalcorrgfe: 0.076905 hartree
zpe.sumelectzpe: -849.928860 hartree
zpe.sumelectthermal: -849.916431 hartree
zpe.sumelectthermalent: -849.915486 hartree
zpe.sumelectthermalfe: -849.968964 hartree
dipole: -2.9751 0.0810 0.0002
dipole: 2.9762
quadrupole: -115.0352 -90.0427 -101.2388
quadrupole: 5.3241 0.0000 0.0008
quadrupole: -12.9296 12.0629 0.8667 5.3241 0.0000 0.0008
hfenergy: -850.0458686 hartree
pointgroup: C01 [X(C10H4Br1F4N1)]
dipole: 1.1475027 0.2321614 -0.0196675 debye
dipolederiv: -0.0570129 -0.1880198 0.0166818 -0.1057224 -0.6737906 0.0605446 0.0093576 0.0607148 0.0014321 -0.747263 0.0686349 0.2214147 0.1044842 -0.377904 -0.1944121 0.2246692 -0.1641519 -0.6015621 -0.746831 0.0265869 -0.2307462 0.0611842 -0.3209448 0.1425234 -0.2412592 0.1121009 -0.6597799 -0.5034722 -0.2149923 0.0193601 -0.226146 -0.7263396 0.0422778 0.0201402 0.0422199 -0.2706666 -1.2631864 0.0892082 -0.009 -0.1586029 -0.1847404 0.0034162 0.0129697 0.0036314 -0.1448559 -0.1071668 -0.0179874 0.0017613 -0.0670997 -0.4400269 0.0217208 0.0061372 0.0216957 -0.1970842 0.2344831 -0.1886083 0.0169305 0.148255 -0.5945591 0.0616499 -0.0130063 0.0612616 0.0910581 0.0304459 0.1717014 -0.0153287 -0.2874343 0.1646509 -0.0090555 0.0254211 -0.0085751 0.0670646 -0.1467816 -0.0418349 0.0036202 0.1785818 0.3695728 -0.0390704 -0.0153822 -0.0392346 -0.0689333 0.2067935 0.4216831 -0.0371999 0.1428545 1.3618223 -0.1321137 -0.0124837 -0.1321353 -0.1108618 -0.3061817 -0.3010627 0.0265894 -0.2105665 -0.4412738 0.0371863 0.018352 0.0371872 -0.0237913 -0.3898092 0.030476 -0.0029381 0.2548937 -0.0835555 -0.0059546 -0.0228089 -0.0062009 -0.1532853 0.0532319 -0.0156063 0.0015503 0.0140573 0.1174036 -0.0208499 -0.0011139 -0.0209207 -0.115642 2.1774075 0.1667029 -0.0140998 0.186842 1.3545775 0.0153636 -0.0151034 0.0154723 1.5244338 1.4704375 -0.0187441 0.0029409 0.1855745 0.2785944 -0.0138556 -0.0152015 -0.0140754 0.121539 -0.2169914 -0.0502087 0.004381 -0.2543021 0.0222667 -0.0148956 0.0224957 -0.014643 -0.1413768 0.0890639 0.0514283 -0.0046943 0.0511239 0.0759531 0.0077509 -0.0045465 0.0077869 0.1616182 0.0925417 -0.0050981 0.0003774 -0.0639437 0.0473537 0.012012 0.005612 0.0121112 0.1825889 0.0854705 -0.0515677 0.0045027 -0.0131325 0.0094574 0.0134589 0.0010957 0.0134282 0.1598321 0.0448208 0.0673085 -0.0061032 0.0590992 0.0414821 0.0123031 -0.0053448 0.0123269 0.1782724 unknown
polarizability: 185.6707831|-9.0313336|166.0057288|0.9368286|-9.8778265|55.9448088 unknown
InChI: InChI=1S/C10H4BrF4N/c11-7-4-9(10(13,14)15)16-8-2-1-5(12)3-6(7)8/h1-4H
charge 0 multiplicity 1
20 atoms
Br 0.673488 3.47606 -0.315956
F  -3.741896 0.293835 1.09868
F  -3.73936 0.085825 -1.157412
F  -3.392818 -1.737476 0.14863
F  4.747461 -0.134625 0.009474
N  -0.755962 -1.091104 0.08902
C  1.112845 0.563506 -0.055921
C  0.595641 -0.794976 0.064079
C  -1.610357 -0.065609 -0.002876
C  0.129113 1.608172 -0.149805
C  -1.229697 1.309724 -0.124917
C  2.524078 0.771958 -0.072979
C  1.514007 -1.889813 0.162244
C  -3.096353 -0.379701 0.023832
C  3.360688 -0.333643 0.025839
C  2.890061 -1.671214 0.144212
H  -1.990558 2.090104 -0.195222
H  2.943297 1.777801 -0.16174
H  1.09134 -2.893954 0.251036
H  3.610382 -2.490871 0.217682
