program: Gaussian 09
title: 000285571
version: EM64L-G09RevD.01
frameworkgroup: C1[X(C11H23N3O2)]
method: RPBEPBE
basis: SDD
operation: Freq
keyword: #p
keyword: freq=noraman
keyword: PBEPBE/SDD
title: #p freq=noraman PBEPBE/SDD
converged: YES YES NO NO
title: Mulliken charges:
elementType: O O N N N C C C C C C C C C C C H H H H H H H H H H H H H H H H H H H H H H H
charge: -0.262068 -0.255732 -0.100404 -0.216146 -0.103948 0.248597 -0.335120 -0.347085 -0.347538 0.161425 -0.480079 -0.654015 -0.662195 -0.685732 -0.614431 -0.603595 0.254998 0.201835 0.256802 0.219692 0.245205 0.278008 0.237081 0.236157 0.215139 0.255178 0.210170 0.214243 0.230853 0.217235 0.212815 0.242883 0.217504 0.238537 0.201261 0.221474 0.226584 0.198718 0.225692
chargesum: 0.00000
title: Mulliken charges with hydrogens summed into heavy atoms:
elementType: O O N N N C C C C C C C C C C C
charge: -0.262068 -0.255732 -0.100404 -0.216146 -0.103948 0.248597 0.121713 0.129409 0.175675 0.161425 -0.006841 0.026472 0.000137 -0.012531 0.046842 0.047400
polarizability: 1.70486643e+02 -3.27460786e+00 1.43107004e+02 2.47927769e-01 -1.24183411e+00 1.30814766e+02
1716.lowfreq: -7.0660 -0.0009 -0.0008 -0.0005 5.5679 7.5927 29.8104 37.8386 44.9207
frequency: 29.3705 37.7398 44.8607 56.6347 65.0368 67.4835 74.8228 100.4006 132.6361 151.0172 155.5020 195.3868 211.7701 219.6884 225.8224 228.3487 242.7229 282.7204 292.6436 311.7669 332.2570 347.8648 370.1632 382.5734 415.3701 444.9376 503.8014 509.3440 559.6806 576.1927 628.0227 674.2341 742.0949 765.6608 775.1612 788.0729 826.1931 844.2186 926.5882 947.2182 973.8297 984.4349 1020.6263 1033.0201 1036.1612 1070.2051 1081.0605 1088.3738 1090.3015 1099.0865 1120.1472 1126.6032 1144.8649 1162.9412 1166.3510 1210.2861 1251.3747 1254.1160 1261.5267 1294.9305 1298.0042 1337.6609 1347.9672 1353.5639 1354.5827 1381.2795 1384.5760 1388.0681 1389.1017 1403.4773 1418.9845 1441.0753 1442.7312 1457.0930 1459.8391 1464.4980 1466.3151 1468.3044 1472.2812 1474.1962 1476.2339 1480.1530 1482.4793 1484.3570 1487.1157 1490.2829 1575.5776 1616.5486 2871.2799 2884.3227 2915.5081 2983.0219 2986.6895 2989.2055 3005.0767 3009.9297 3010.7648 3015.5032 3022.0467 3031.3106 3072.8268 3074.3734 3078.8258 3079.3448 3084.1904 3086.2501 3087.5512 3089.0612 3104.3988 3106.2243 3131.0550
redmass: 2.9792 2.7357 2.7208 3.1393 3.1189 2.6996 3.5561 3.6039 3.6629 4.0791 3.2371 2.6643 1.1166 1.4842 1.2602 1.2185 1.0538 1.8276 2.3657 2.7568 2.6822 2.6611 2.6394 2.4053 2.5599 3.3876 4.4987 3.7494 3.6181 3.8748 6.7799 4.1306 5.7792 1.2213 1.3019 1.2555 4.3303 2.1233 2.3724 2.1468 2.5963 1.8654 2.7035 1.8984 1.8279 2.1038 1.8388 1.8484 1.5285 1.8151 1.6691 2.1087 1.7644 2.2446 2.5241 2.8124 1.8051 1.8505 2.0327 1.3488 1.3643 1.2721 1.3823 1.9566 1.3382 1.3726 1.2235 1.2221 1.2291 2.3296 1.1423 1.1309 1.1284 1.0853 1.0489 1.0598 1.0451 1.0454 1.0551 1.0470 1.0577 1.0736 1.0590 1.0560 1.0558 1.0895 7.8437 7.5415 1.0548 1.0548 1.0655 1.0354 1.0354 1.0357 1.0633 1.0655 1.0922 1.0679 1.0750 1.0756 1.1010 1.0992 1.1005 1.1006 1.0987 1.1008 1.0992 1.0983 1.1026 1.1021 1.0926
irintensity: 0.2500 0.1038 0.8968 1.1361 3.7069 0.8186 3.3653 4.4210 0.5233 0.7736 2.4978 1.2968 0.6617 0.3566 1.2719 1.0606 0.6375 0.5706 0.9037 2.3898 12.9022 11.6750 0.4594 6.6924 1.2827 6.9573 4.4834 1.1280 8.9791 23.9872 1.1546 6.2946 8.3751 11.3909 5.2550 30.6347 24.4035 13.9527 6.2300 7.3078 6.1982 23.6126 12.0123 40.7029 21.1609 14.6117 8.0320 4.1040 1.2770 21.2714 15.5005 38.5334 25.2383 54.1046 15.0344 42.4374 124.9385 33.2956 17.1199 59.5726 14.8358 7.4629 11.6919 104.1335 9.6108 9.0601 2.5575 14.1012 49.5302 69.9358 4.2646 10.6104 12.4353 22.2040 12.8854 4.0089 4.4471 10.6244 10.6995 14.1990 4.0057 18.0096 11.1377 8.9198 10.5990 5.1982 154.7304 355.4785 86.9189 137.3133 77.5461 22.5208 24.9225 25.5954 20.6028 26.3575 23.9368 33.0506 36.0808 36.0802 3.7610 25.1218 30.4337 10.9453 63.2583 58.3912 34.2172 17.4404 6.1170 26.8324 17.3695
temp: 298.150 k
press: 1.00000 atm
elementType: 8 8 7 7 7 6 6 6 6 6 6 6 6 6 6 6 1 1 1 1 1 1 1 1 1 1 1 1 1 1 1 1 1 1 1 1 1 1 1
symmnumber: 1
zpe: 885065.4 jmol-1
zpe.correction: 0.337104 hartree
zpe.thermalcorrener: 0.357157 hartree
zpe.thermalcorrenthalpy: 0.358101 hartree
zpe.thermalcorrgfe: 0.287550 hartree
zpe.sumelectzpe: -746.358437 hartree
zpe.sumelectthermal: -746.338383 hartree
zpe.sumelectthermalent: -746.337439 hartree
zpe.sumelectthermalfe: -746.407991 hartree
dipole: -2.1977 -1.0044 3.3452
dipole: 4.1266
quadrupole: -83.3962 -103.4137 -102.3453
quadrupole: -6.0665 5.7142 -2.5626
quadrupole: 12.9889 -7.0286 -5.9602 -6.0665 5.7142 -2.5626
hfenergy: -746.6955407 hartree
pointgroup: C01 [X(C11H23N3O2)]
dipole: 0.8866437 -0.2352562 -1.3395446 debye
polarizability: 168.7791305|7.3965146|144.7636154|-0.6838215|1.3023588|130.8656672 unknown
InChI: InChI=1S/C11H23N3O2/c1-6-13(7-2)11(16)14(8-3)10(15)9-12(4)5/h6-9H2,1-5H3
charge 0 multiplicity 1
39 atoms
O  -1.928468 1.573923 1.05589
O  0.486407 -1.241101 1.543503
N  -1.934682 -0.424877 -0.137045
N  0.159043 0.731857 0.333016
N  3.202827 0.278136 -0.090398
C  -1.308026 0.641594 0.460402
C  -3.398077 -0.56124 0.086736
C  -1.280051 -1.474128 -0.950208
C  0.639095 2.091155 -0.073111
C  0.96286 -0.181028 1.027017
C  2.463654 0.134784 1.187898
C  -3.717269 -1.330551 1.385907
C  -1.40633 -1.212873 -2.466644
C  0.083767 2.511351 -1.445348
C  3.142653 -0.944122 -0.920926
C  4.592654 0.732193 0.134962
H  -3.831561 0.451818 0.134328
H  -3.823296 -1.080769 -0.79168
H  -0.226932 -1.562357 -0.653174
H  -1.752651 -2.439577 -0.688323
H  0.327351 2.818435 0.699693
H  1.736388 2.036647 -0.132115
H  2.860584 -0.694523 1.819045
H  2.578452 1.076238 1.760891
H  -3.262628 -2.337341 1.380348
H  -3.326523 -0.780732 2.258235
H  -4.810768 -1.44287 1.504127
H  -2.463455 -1.138839 -2.780834
H  -0.89958 -0.272099 -2.744359
H  -0.941132 -2.040007 -3.034427
H  0.414722 1.813344 -2.235144
H  -1.019563 2.553307 -1.44083
H  0.456746 3.520232 -1.699065
H  2.091457 -1.192685 -1.148549
H  3.608051 -1.832797 -0.427856
H  3.664375 -0.761555 -1.876795
H  5.089216 0.895116 -0.837884
H  5.206232 0.002414 0.719568
H  4.589358 1.692029 0.682451
