program: Gaussian 09
title: 000285537
version: EM64L-G09RevD.01
frameworkgroup: C1[X(C18H15NO3)]
method: RPBEPBE
basis: SDD
operation: Freq
keyword: #p
keyword: freq=noraman
keyword: PBEPBE/SDD
title: #p freq=noraman PBEPBE/SDD
converged: YES YES NO NO
title: Mulliken charges:
elementType: O O O N C C C C C C C C C C C C C C C C C C H H H H H H H H H H H H H H H
charge: -0.259409 -0.443711 -0.255256 -0.033887 0.304869 -0.295175 0.174604 0.055593 0.431157 -0.384073 0.356298 -0.389937 -0.439750 -0.244617 -0.803472 -0.356199 -0.383081 0.113258 -0.379701 -0.356370 0.321185 -0.536833 0.270066 0.298994 0.237283 0.229375 0.211598 0.241226 0.241776 0.222063 0.277515 0.251174 0.240889 0.388069 0.223779 0.246834 0.223868
chargesum: 0.00000
title: Mulliken charges with hydrogens summed into heavy atoms:
elementType: O O O N C C C C C C C C C C C C C C C C C C
charge: -0.259409 -0.055642 -0.255256 -0.033887 0.304869 -0.295175 0.174604 0.055593 0.431157 -0.114007 0.356298 -0.090943 -0.202466 -0.015242 -0.108872 -0.134136 -0.105566 0.113258 -0.128527 -0.115481 0.321185 0.157648
polarizability: 4.07914243e+02 -2.02290795e+01 2.50921955e+02 3.36232196e-02 -3.33523355e-01 9.02519626e+01
1716.lowfreq: -4.6439 -0.0006 -0.0005 -0.0004 3.0847 5.5370 18.1776 35.8833 44.7359
frequency: 18.0738 35.8810 44.7256 68.0127 72.8739 100.8268 125.7542 146.8338 167.9758 182.2908 198.3632 200.3702 230.6411 246.9446 279.5394 280.6626 316.0456 362.5890 372.8359 412.3869 413.9857 435.2913 461.1936 501.5459 503.1221 530.5565 547.8539 554.9651 555.5337 589.2035 606.0680 621.8231 632.6894 683.8543 694.0763 734.4597 754.7175 768.7902 787.0500 818.5933 825.1534 834.6810 842.1864 845.0621 874.2043 926.5729 934.1256 960.2240 977.3149 985.8226 987.3999 998.9156 1001.0778 1025.0931 1049.7203 1060.6506 1097.6483 1112.0482 1113.3977 1127.1695 1158.9316 1177.1643 1185.4146 1217.7653 1236.1092 1254.9279 1279.0035 1290.1148 1305.6286 1325.8032 1342.9586 1369.7271 1377.7829 1400.2609 1416.6351 1422.0931 1438.7097 1443.5846 1453.0970 1468.5704 1472.6960 1473.9125 1494.8012 1515.9180 1545.5138 1576.7252 1584.4888 1610.9690 1621.3309 1636.5242 2964.0326 2988.0866 3053.7718 3070.8285 3091.5067 3125.3790 3127.9509 3146.0986 3149.1361 3150.0903 3168.4603 3172.5331 3189.5417 3200.2310 3532.1002
redmass: 3.5791 7.2179 6.2875 4.2367 5.2506 3.8384 1.0845 4.0910 5.7816 4.7588 3.0587 3.7888 1.2724 7.1151 3.4937 3.5674 6.0480 5.1549 8.7069 2.9467 4.5368 3.7212 4.6534 3.0000 4.8530 6.0434 2.3482 5.4074 3.3601 5.5921 1.5629 5.4795 7.0890 3.3726 5.9465 4.2653 4.6921 5.9315 1.7475 1.3164 2.3026 7.2156 1.7276 5.6113 6.1883 1.3740 1.6119 1.3734 2.0855 8.8395 1.3618 2.8574 1.3285 2.7461 1.5640 3.0276 1.8213 1.5257 1.2591 1.9871 1.3368 1.2289 1.2456 2.3032 2.8898 2.2111 2.6227 1.9252 1.5042 4.0298 4.0794 4.9340 4.4201 1.2669 2.4205 4.3395 1.1974 3.4463 1.0468 1.0497 1.1893 1.1160 2.9233 3.2059 7.4538 7.3818 6.8847 5.6968 6.3912 8.4482 1.0327 1.0361 1.1041 1.0965 1.1008 1.0881 1.0998 1.0875 1.0942 1.0875 1.0954 1.0965 1.0950 1.0906 1.0642
irintensity: 0.7635 0.2152 1.8069 0.2533 0.7124 1.7118 0.0462 6.5149 0.4723 5.7951 1.7068 3.4252 0.4853 1.4658 0.1746 0.5367 6.9469 2.6166 1.1412 0.0545 1.7687 4.9725 1.2090 7.6751 18.1736 1.4211 52.4207 26.2738 3.1916 33.6413 96.0860 41.2745 2.3007 7.1777 2.5459 4.9078 13.1401 8.1749 52.3550 0.8661 14.5221 1.7349 83.2553 11.2956 5.3292 1.3717 14.7950 0.0582 38.1380 60.0582 0.4577 15.7394 2.1196 208.2669 8.2188 15.4001 8.6087 12.4165 0.2547 154.4950 4.6325 212.9676 6.8459 10.6042 169.6062 57.2750 16.4402 42.9436 6.8402 34.6248 97.4984 95.4432 18.1020 18.2070 18.6851 0.5224 10.6766 24.1457 13.3538 13.9697 16.6913 52.5801 104.0362 28.0760 185.5224 9.5047 115.7238 15.3900 110.5342 222.5774 82.9532 26.3684 45.9449 14.2734 26.9039 15.8156 28.5385 11.3492 31.3028 5.4406 13.8931 9.0917 12.1851 0.2455 54.7494
temp: 298.150 k
press: 1.00000 atm
elementType: 8 8 8 7 6 6 6 6 6 6 6 6 6 6 6 6 6 6 6 6 6 6 1 1 1 1 1 1 1 1 1 1 1 1 1 1 1
symmnumber: 1
zpe: 746854.8 jmol-1
zpe.correction: 0.284462 hartree
zpe.thermalcorrener: 0.303596 hartree
zpe.thermalcorrenthalpy: 0.304540 hartree
zpe.thermalcorrgfe: 0.235559 hartree
zpe.sumelectzpe: -973.820769 hartree
zpe.sumelectthermal: -973.801635 hartree
zpe.sumelectthermalent: -973.800691 hartree
zpe.sumelectthermalfe: -973.869672 hartree
dipole: -2.3761 -1.1640 0.0292
dipole: 2.6460
quadrupole: -112.2143 -107.9184 -132.7169
quadrupole: 5.7978 -0.3004 -0.1233
quadrupole: 5.4022 9.6982 -15.1004 5.7978 -0.3004 -0.1233
hfenergy: -974.1052314 hartree
pointgroup: C01 [X(C18H15N1O3)]
dipole: -0.9274478 -0.470587 -0.0460289 debye
polarizability: 408.3856696|-18.1829428|249.3573479|5.0219375|12.376872|91.3451427 unknown
InChI: InChI=1S/C18H15NO3/c1-11-4-3-5-14-15(18(20)21)10-16(19-17(11)14)12-6-8-13(22-2)9-7-12/h3-10,20H,1-2H3
charge 0 multiplicity 1
37 atoms
O  -5.907054 0.323541 -0.065224
O  1.937429 3.702287 0.380602
O  4.027565 2.722098 0.356602
N  0.42191 -1.047958 -0.045024
C  2.673097 0.014844 0.092057
C  1.799183 -1.144745 -0.023892
C  2.012983 1.301415 0.186227
C  -0.172911 0.168993 0.043783
C  2.362647 -2.4739 -0.124676
C  0.613963 1.362492 0.16115
C  -1.66014 0.208877 0.015295
C  4.090707 -0.182956 0.105176
C  3.755377 -2.610602 -0.107597
C  4.613143 -1.474717 0.00653
C  1.447952 -3.67351 -0.245443
C  -2.397946 1.426738 0.080928
C  -2.392815 -1.003832 -0.08161
C  2.781068 2.576825 0.311187
C  -3.801084 1.43025 0.051575
C  -3.800185 -1.018639 -0.111711
C  -4.511932 0.207137 -0.044372
C  -6.692798 -0.910982 -0.156335
H  0.138213 2.340475 0.234851
H  4.748884 0.683097 0.192895
H  4.195707 -3.611721 -0.183735
H  5.698987 -1.620932 0.016736
H  2.031127 -4.607618 -0.316853
H  0.769166 -3.742555 0.623381
H  0.799533 -3.588684 -1.13572
H  -1.884182 2.390256 0.154661
H  -1.825564 -1.937882 -0.133222
H  -4.369492 2.363693 0.101547
H  -4.326876 -1.974671 -0.186925
H  2.508408 4.512505 0.463459
H  -6.4755 -1.457268 -1.094451
H  -7.742362 -0.582903 -0.152441
H  -6.504106 -1.571547 0.711788
