program: Gaussian 09
title: 000285534
version: EM64L-G09RevD.01
frameworkgroup: C1[X(C22H19NO2)]
method: RPBEPBE
basis: SDD
operation: Freq
keyword: #p
keyword: freq=noraman
keyword: PBEPBE/SDD
title: #p freq=noraman PBEPBE/SDD
converged: YES YES NO NO
title: Mulliken charges:
elementType: O O N C C C C C C C C C C C C C C C C C C C C C C H H H H H H H H H H H H H H H H H H H
charge: -0.418604 -0.227662 -0.357713 -0.105598 0.314845 0.100314 0.452255 0.025657 0.362391 -0.390266 -0.374938 -0.395372 -0.393356 0.330896 -0.216622 -0.319375 -0.227020 -0.392423 -0.380647 0.433841 -0.399606 -0.828652 -0.252687 -0.238074 -0.806786 0.264577 0.271534 0.355517 0.249395 0.284338 0.264899 0.232835 0.234684 0.232696 0.230059 0.230027 0.284893 0.224786 0.200966 0.229042 0.226111 0.225699 0.236807 0.226336
chargesum: 0.00000
title: Mulliken charges with hydrogens summed into heavy atoms:
elementType: O O N C C C C C C C C C C C C C C C C C C C C C C
charge: -0.063087 -0.227662 -0.357713 -0.105598 0.314845 0.100314 0.452255 0.025657 0.362391 -0.125690 -0.103404 -0.145977 -0.109018 0.330896 0.016213 -0.054475 0.007664 -0.159727 -0.150588 0.433841 -0.169579 -0.118007 -0.023646 -0.011963 -0.117943
polarizability: 2.78759982e+02 -1.77058154e+01 2.85540157e+02 -3.70561389e+00 7.54657477e+00 1.74782002e+02
1716.lowfreq: -5.4761 -0.0006 -0.0005 0.0003 3.6495 4.8223 20.8120 39.7023 40.8071
frequency: 20.6282 39.6852 40.7754 48.8488 58.4189 63.0940 71.4371 132.9880 141.1147 143.4770 163.6782 180.9549 198.4716 222.7839 242.9471 262.0625 282.0866 295.8445 320.9297 334.2756 340.0755 362.0427 385.0291 404.5419 411.4146 446.4443 453.9906 480.7442 509.6668 524.9363 532.6557 550.1976 579.9466 588.0850 611.1633 636.3434 664.4561 679.4984 684.7046 724.3784 729.4800 757.4509 766.5749 769.4923 785.1245 789.6004 813.8250 840.8763 854.4464 863.9255 870.1870 891.5536 904.6693 947.1696 965.7962 966.7010 979.4289 985.3428 986.9102 987.7468 998.5152 1000.2621 1007.7199 1014.6347 1022.1136 1045.1914 1047.3804 1047.7362 1093.4537 1102.5142 1127.3713 1131.1275 1155.5646 1169.5351 1173.9072 1187.2040 1197.4126 1208.9262 1223.9468 1235.4271 1277.8341 1283.0312 1301.6184 1315.5894 1338.2123 1371.5855 1375.6650 1395.8144 1397.5426 1404.4678 1405.9297 1435.9622 1452.3161 1459.3298 1463.1970 1472.3661 1472.9456 1478.2665 1485.9947 1508.2040 1584.7800 1586.2235 1609.5062 1612.5754 1619.2816 1624.0790 1639.1483 2975.5873 2975.9466 3054.6286 3056.9132 3085.9681 3086.9900 3118.1432 3121.0132 3126.0283 3133.4028 3136.5289 3141.5622 3146.7518 3155.6384 3158.1117 3169.4973 3174.8065 3179.8917 3555.4810
redmass: 4.3166 4.2528 1.0459 3.5774 4.7672 4.6791 5.1640 2.3788 3.0092 2.0226 4.1567 2.7276 4.9034 4.2599 6.1652 2.9194 4.8534 3.3413 2.2043 2.6013 3.8127 3.3838 3.7513 2.8613 3.2522 4.5597 2.9232 3.9650 3.7162 4.4241 7.0539 4.0548 5.1346 6.0154 7.2046 6.9810 5.6500 5.2098 4.8005 2.9668 3.5189 1.6950 1.8783 4.2632 4.0654 2.0158 2.0894 5.2425 1.7165 1.6519 1.3777 1.6781 2.7303 1.4075 1.3921 1.4152 2.1468 1.5751 1.4053 1.3436 2.5582 1.3379 3.3273 2.7726 3.0740 1.8307 1.7788 1.6150 2.1251 3.7436 1.3086 1.7199 1.9922 1.1290 1.0576 2.3134 1.1666 2.4936 3.0110 3.1154 1.5709 1.4886 1.6338 2.0070 2.7786 8.6022 5.0812 1.2382 1.2247 4.0843 4.7572 2.1948 2.4977 2.4093 1.1104 1.0959 1.0538 1.3419 2.0376 2.6800 6.3840 6.5264 7.5001 6.6558 7.5424 6.4070 11.6238 1.0387 1.0371 1.0967 1.0949 1.0998 1.0989 1.0872 1.0865 1.0902 1.0860 1.0900 1.0965 1.0901 1.0961 1.0955 1.1003 1.0975 1.0938 1.0656
irintensity: 0.3082 0.5190 0.4881 0.0192 1.8510 0.3200 1.1394 2.0804 0.0994 1.6923 2.4785 0.6599 1.6325 1.3552 0.9434 18.7972 1.6558 8.3154 58.3846 54.8789 11.6093 31.3134 5.3454 1.1635 3.6435 0.7060 6.8609 13.9986 0.4717 1.9165 8.1227 5.8236 13.4777 2.6740 13.6459 0.4963 2.3626 11.7883 19.4416 10.6995 4.2361 41.2286 81.0534 8.1137 4.8923 24.3932 62.3281 12.6714 1.9688 4.2460 2.1946 16.5270 48.2997 2.5657 4.8759 1.7810 18.0552 0.9262 3.5521 0.4875 37.5633 0.7006 19.2147 16.3270 20.3505 8.8788 9.7940 13.8225 5.7554 33.7179 6.5130 18.1227 48.4334 4.5883 1.8523 8.3257 6.4248 4.3865 1.4489 35.5901 2.9857 13.0126 20.4168 82.2190 184.4414 3.2980 26.1541 16.7869 12.2503 6.3329 8.1968 9.9736 17.4483 10.8280 19.2015 18.6324 11.6652 16.5034 74.5321 23.4746 1.0532 2.7976 0.9284 4.5566 13.7865 5.2901 236.4715 40.4553 27.2654 20.4916 20.7749 16.8406 26.3966 12.2187 5.9805 24.1886 1.2852 16.3592 10.7399 7.2140 34.7740 9.6944 27.7908 9.6184 1.7961 9.2943
temp: 298.150 k
press: 1.00000 atm
elementType: 8 8 7 6 6 6 6 6 6 6 6 6 6 6 6 6 6 6 6 6 6 6 6 6 6 1 1 1 1 1 1 1 1 1 1 1 1 1 1 1 1 1 1 1
symmnumber: 1
zpe: 911586.8 jmol-1
zpe.correction: 0.347205 hartree
zpe.thermalcorrener: 0.369060 hartree
zpe.thermalcorrenthalpy: 0.370004 hartree
zpe.thermalcorrgfe: 0.295261 hartree
zpe.sumelectzpe: -1053.231942 hartree
zpe.sumelectthermal: -1053.210087 hartree
zpe.sumelectthermalent: -1053.209143 hartree
zpe.sumelectthermalfe: -1053.283886 hartree
dipole: -2.1943 -2.0575 1.7942
dipole: 3.5025
quadrupole: -134.7159 -126.8500 -147.9596
quadrupole: -4.9216 11.3000 2.7419
quadrupole: 1.7926 9.6585 -11.4511 -4.9216 11.3000 2.7419
hfenergy: -1053.579147 hartree
pointgroup: C01 [X(C22H19N1O2)]
dipole: 0.6172161 -1.0637875 0.6214968 debye
polarizability: 292.3404227|15.2990573|271.477179|-9.1234952|4.6029698|175.264539 unknown
InChI: InChI=1S/C22H19NO2/c1-15-11-13-17(14-12-15)22(25)19-9-5-4-8-18(19)21(24)23(22)20-10-6-3-7-16(20)2/h3-14,25H,1-2H3
charge 0 multiplicity 1
44 atoms
O  0.285362 0.053862 2.191929
O  0.431248 2.882588 -1.396551
N  -0.139229 1.021244 -0.017371
C  0.567161 -0.069359 0.75681
C  2.033255 0.247884 0.444836
C  2.125611 1.378092 -0.391036
C  0.1448 -1.485309 0.350104
C  0.750355 1.88626 -0.692725
C  -1.571601 1.202014 0.005143
C  3.186668 -0.416052 0.893591
C  3.367351 1.886062 -0.812371
C  0.475281 -1.966514 -0.94046
C  -0.5845 -2.317998 1.227431
C  -2.133514 2.357868 0.624549
C  4.445478 0.087708 0.47923
C  -2.405718 0.232454 -0.601941
C  4.536469 1.224745 -0.366163
C  0.076824 -3.256625 -1.345113
C  -0.978478 -3.610751 0.816307
C  -0.655475 -4.105021 -0.472404
C  -3.544412 2.496318 0.612112
C  -1.271417 3.426202 1.26646
C  -3.807318 0.387793 -0.591723
C  -4.380127 1.526446 0.016918
C  -1.055426 -5.506805 -0.898592
H  3.114019 -1.297284 1.538975
H  3.410846 2.764276 -1.464572
H  0.631647 0.930472 2.499943
H  1.039898 -1.330847 -1.632972
H  -0.840376 -1.944557 2.221977
H  -1.952453 -0.634009 -1.090446
H  5.363207 -0.408639 0.813681
H  5.522262 1.589826 -0.674344
H  0.336262 -3.612412 -2.349634
H  -1.549243 -4.243476 1.506991
H  -3.989986 3.381371 1.081714
H  -0.739679 4.010616 0.493133
H  -1.884252 4.118877 1.867608
H  -0.500603 2.990146 1.92971
H  -4.442367 -0.368344 -1.065716
H  -5.467595 1.660663 0.026189
H  -1.221485 -5.567739 -1.988632
H  -0.26407 -6.239328 -0.645891
H  -1.979684 -5.835721 -0.391888
