program: Gaussian 09
title: 000285501
version: EM64L-G09RevD.01
frameworkgroup: C1[X(C9H19N3O2S)]
method: RPBEPBE
basis: SDD
operation: Freq
keyword: #p
keyword: freq=noraman
keyword: PBEPBE/SDD
title: #p freq=noraman PBEPBE/SDD
converged: NO YES NO NO
title: Mulliken charges:
elementType: S O O N N N C C C C C C C C C H H H H H H H H H H H H H H H H H H H
charge: 1.046349 -0.530459 -0.531427 -0.316446 -0.331305 -0.303173 -0.358099 -0.370311 -0.384315 -0.376992 -0.401865 -0.318862 -0.329999 -0.402927 -0.398178 0.225089 0.251167 0.271327 0.209652 0.207688 0.211300 0.212093 0.210041 0.220103 0.199291 0.242944 0.240806 0.259011 0.229774 0.198373 0.220489 0.221918 0.199697 0.277244
chargesum: 0.00000
title: Mulliken charges with hydrogens summed into heavy atoms:
elementType: S O O N N N C C C C C C C C C
charge: 1.046349 -0.530459 -0.531427 -0.316446 -0.331305 -0.025929 0.118157 0.110668 0.034673 0.045142 0.017529 0.164888 0.158787 0.015935 0.023437
polarizability: 1.91112761e+02 -6.69144483e-01 1.39994772e+02 4.60338574e+00 1.21652657e+00 1.32626200e+02
1716.lowfreq: -6.6967 -0.0020 -0.0019 -0.0014 3.5910 16.6315 29.7951 41.7836 53.3196
frequency: 29.2575 41.7534 53.0659 87.4491 128.0066 155.5640 184.6658 201.6075 206.5446 233.4689 247.2254 259.2138 299.0653 306.5113 356.7379 390.9079 394.1507 400.1230 437.7341 450.7726 453.2515 466.3111 519.0799 587.7548 602.5316 662.1391 798.1759 800.8802 806.0466 815.9418 847.7604 849.0108 859.6039 875.9912 895.6431 910.5476 940.5061 957.4336 1002.7739 1031.6465 1035.3128 1043.5801 1051.6349 1057.0684 1089.6665 1100.6236 1104.1864 1142.1397 1148.1766 1164.8500 1190.2064 1206.3566 1225.1548 1256.0500 1261.1133 1265.7832 1274.4295 1283.8297 1312.9638 1318.9001 1321.1621 1334.6326 1342.4758 1343.4902 1344.7957 1353.4712 1377.3104 1437.4426 1450.1755 1453.2658 1456.4723 1460.4168 1464.2496 1466.4307 1469.1982 1470.2002 1482.7792 2886.4830 2892.2652 2929.7078 2946.1861 2965.8101 2975.6170 2976.7136 2991.9024 2994.4923 3039.7848 3044.6016 3048.0914 3053.5429 3061.8453 3072.1633 3080.3082 3081.8692 3087.9567 3490.0700
redmass: 3.3390 4.0225 3.0522 4.6899 5.0800 4.6368 4.1162 6.0129 7.6298 2.1946 2.3479 2.2348 3.6336 2.4810 2.7751 3.3701 4.6908 2.5878 3.1360 2.5435 2.9028 2.1114 3.5506 2.9523 2.5035 1.7822 3.8120 1.5754 6.4244 4.6317 1.4901 2.5771 1.5273 2.9504 2.8630 2.2826 5.5967 1.3230 2.2265 2.1787 2.0354 1.9032 1.7883 1.9284 3.4750 2.1760 2.5019 2.2013 1.1828 2.6275 1.1736 1.8069 1.4019 1.2698 1.2056 1.2545 1.2651 1.2514 1.2228 1.2631 1.2358 1.3590 1.3814 1.3956 1.3128 1.3223 1.3862 1.3391 1.0879 1.0785 1.0740 1.0858 1.0917 1.0847 1.0834 1.1005 1.0886 1.0702 1.0690 1.0686 1.0670 1.0650 1.0624 1.0633 1.0613 1.0607 1.0973 1.0901 1.0918 1.1020 1.1021 1.0960 1.0946 1.0987 1.0975 1.0758
irintensity: 1.0484 0.8503 0.1705 0.7903 0.1536 1.4988 2.9618 4.2639 27.9308 2.1284 3.4298 2.1695 2.3844 3.0873 7.1826 7.2244 17.1774 16.3001 0.4537 83.3028 23.0982 28.7032 28.6166 92.1283 16.5162 53.7824 27.1007 2.2707 69.7418 30.7153 1.0596 18.3098 6.7496 13.7157 33.5645 1.7941 43.3133 6.1758 21.2918 11.8439 1.7639 9.1840 0.4595 12.2357 22.9178 8.8671 0.6261 13.0715 0.9508 8.2784 1.0525 17.1208 17.0180 4.6459 11.3477 4.3617 11.3230 13.2425 32.6724 1.5576 0.3012 0.9176 2.3645 2.8257 3.0137 0.3984 5.9640 9.2307 6.7354 3.6474 1.5473 19.6655 27.7285 15.2806 7.7159 0.7787 12.9428 69.8183 107.1803 54.4672 37.8573 50.0737 40.1689 28.4565 28.2118 35.5752 50.7401 42.0752 39.8119 23.5660 57.3790 18.7670 9.8363 13.0471 7.8277 0.2156
temp: 298.150 k
press: 1.00000 atm
elementType: 16 8 8 7 7 7 6 6 6 6 6 6 6 6 6 1 1 1 1 1 1 1 1 1 1 1 1 1 1 1 1 1 1 1
symmnumber: 1
zpe: 752010.0 jmol-1
zpe.correction: 0.286425 hartree
zpe.thermalcorrener: 0.302247 hartree
zpe.thermalcorrenthalpy: 0.303191 hartree
zpe.thermalcorrgfe: 0.242848 hartree
zpe.sumelectzpe: -1065.703897 hartree
zpe.sumelectthermal: -1065.688075 hartree
zpe.sumelectthermalent: -1065.687131 hartree
zpe.sumelectthermalfe: -1065.747474 hartree
dipole: -0.1663 -5.5300 0.4545
dipole: 5.5512
quadrupole: -80.1051 -106.9495 -101.9539
quadrupole: -3.9658 2.5230 0.7701
quadrupole: 16.2310 -10.6133 -5.6177 -3.9658 2.5230 0.7701
hfenergy: -1065.990322 hartree
pointgroup: C01 [X(C9H19N3O2S1)]
dipole: 0.0567535 2.1755584 0.1831865 debye
polarizability: 191.2868412|-0.5246241|139.9955867|-3.3344675|-1.2276499|132.451305 unknown
InChI: InChI=1S/C9H19N3O2S/c13-15(14,11-6-2-1-3-7-11)12-8-4-10-5-9-12/h10H,1-9H2
charge 0 multiplicity 1
34 atoms
S  -0.002826 -1.362585 0.014776
O  0.069996 -2.197054 -1.385644
O  -0.07167 -2.172711 1.430319
N  1.384333 -0.093849 -0.076795
N  -1.397438 -0.104209 0.088445
N  -3.872873 1.120037 -0.390376
C  1.640037 0.499267 1.270183
C  2.611361 -0.697501 -0.684796
C  2.629266 1.673207 1.074061
C  3.604516 0.459706 -0.936104
C  3.928893 1.199876 0.382383
C  -1.657898 0.487944 -1.256899
C  -2.628239 -0.69823 0.695916
C  -2.656039 1.648478 -1.034123
C  -3.606279 0.478497 0.911096
H  2.064892 -0.25111 1.972481
H  0.679119 0.85817 1.675799
H  2.322833 -1.194849 -1.625071
H  3.076961 -1.451382 -0.010353
H  2.846644 2.11815 2.063856
H  2.139248 2.450454 0.457225
H  3.15665 1.163537 -1.663167
H  4.522874 0.043893 -1.392473
H  4.592789 2.062407 0.185599
H  4.48009 0.516495 1.060508
H  -2.093723 -0.251514 -1.959236
H  -0.705284 0.869864 -1.660774
H  -2.355562 -1.169403 1.654226
H  -3.104104 -1.448251 0.030007
H  -2.141621 2.431977 -0.426527
H  -2.917822 2.084193 -2.015438
H  -4.551496 0.083609 1.325577
H  -3.154636 1.172448 1.660479
H  -4.656494 1.78144 -0.375762
