program: Gaussian 09
title: 000024022
version: EM64L-G09RevD.01
frameworkgroup: C1[X(C14H19NO2)]
method: RPBEPBE
basis: SDD
operation: Freq
keyword: #p
keyword: freq=noraman
keyword: PBEPBE/SDD
title: #p freq=noraman PBEPBE/SDD
converged: YES YES NO NO
title: Mulliken charges:
elementType: O O N C C C C C C C C C C C C C C H H H H H H H H H H H H H H H H H H H
charge: -0.285973 -0.244306 -0.336582 -0.062413 -0.125138 -0.402747 -0.422876 -0.352588 -0.418504 -0.379686 -0.143061 0.348524 -0.374901 -0.368076 -0.218999 -0.220230 -0.237708 0.211189 0.250515 0.199655 0.224482 0.217182 0.192225 0.257632 0.190424 0.206506 0.177595 0.211468 0.210020 0.240946 0.252836 0.259788 0.259087 0.227568 0.227411 0.228737
chargesum: 0.00000
title: Mulliken charges with hydrogens summed into heavy atoms:
elementType: O O N C C C C C C C C C C C C C C
charge: -0.285973 -0.244306 -0.078950 0.148776 0.125376 0.021389 -0.013469 0.044343 -0.029440 0.071279 0.109775 0.348524 -0.115113 -0.108989 0.008568 0.007181 -0.008971
polarizability: 1.75147627e+02 3.99134002e+00 1.57738221e+02 1.47145180e+01 -4.21229937e+00 1.27162033e+02
1716.lowfreq: -24.1129 -9.8128 -0.0004 -0.0003 0.0007 7.6372 11.8453 37.3298 43.9117
frequency: 10.7100 36.6272 43.5800 83.6707 112.9929 130.7412 182.2494 204.3497 222.7004 267.5985 299.3538 333.5783 375.3685 403.3010 409.4654 435.4201 443.7533 456.9322 478.6730 523.2106 605.9505 614.5433 658.0216 678.0773 705.6436 721.7712 740.6568 806.3533 828.8650 840.0619 846.6191 860.9584 866.7565 881.8684 911.2693 915.0921 927.6726 940.0199 972.3383 986.1985 988.8413 992.7283 999.4247 1023.3549 1034.3294 1054.3810 1070.8492 1072.6726 1078.4309 1114.5706 1130.5773 1145.1517 1155.8686 1170.8405 1180.2257 1190.0883 1204.3311 1210.6688 1235.1557 1243.1066 1261.3036 1270.0854 1282.5390 1294.8390 1308.7519 1312.5283 1322.5260 1333.7654 1336.5481 1346.1371 1357.3605 1374.2830 1382.5551 1433.6007 1449.5785 1458.8278 1461.7151 1464.8452 1469.3603 1472.7526 1477.2159 1592.0013 1612.0791 2841.4139 2853.0990 2963.8831 2967.3298 2986.2800 2987.1302 3025.0670 3029.8197 3035.4649 3040.5171 3052.0251 3064.4160 3104.6858 3123.0010 3132.8135 3146.0415 3155.5630 3165.7799 3421.4406
redmass: 4.8075 3.6914 3.1601 3.4532 3.8681 3.4787 4.6392 3.9457 1.9460 5.0611 1.9891 5.0905 4.4545 2.8791 2.5122 3.0318 3.8831 3.6474 3.1946 1.4664 5.8938 6.4263 3.5193 1.6376 2.5961 3.8412 1.8669 2.0535 2.8153 1.8408 3.0934 1.4538 1.9622 3.6819 2.3472 2.2836 2.9128 1.6624 3.6669 1.4186 4.7276 2.1397 1.3408 2.7202 2.7169 2.3827 1.7115 1.8745 1.5587 2.0214 2.5875 2.4297 1.4603 1.0544 1.1561 1.2188 2.6294 1.5809 1.2428 1.2111 1.2352 1.1947 1.2441 1.2598 1.3016 1.3057 1.2399 1.3851 1.3486 1.4470 1.3831 1.5750 8.8780 2.1984 1.1107 1.2530 1.1152 1.0913 1.0986 1.0917 2.2775 6.3370 6.0970 1.0797 1.0714 1.0637 1.0675 1.0623 1.0622 1.0858 1.0905 1.0942 1.0874 1.1030 1.1000 1.0982 1.0846 1.0882 1.0927 1.0957 1.1009 1.0742
irintensity: 0.1774 0.0964 0.2828 0.9877 1.1680 0.3782 1.7927 4.3160 1.6121 2.4033 2.6471 6.9515 2.7301 0.2152 5.3425 7.7967 2.5067 5.3299 2.0620 41.8025 14.0097 0.0051 13.1711 54.0966 25.0661 26.4625 66.8142 3.0501 5.8292 15.0123 17.8584 9.6020 14.0078 46.1327 10.0429 5.9708 2.5170 30.7059 9.4333 2.0313 7.7437 45.3246 1.9284 56.4643 65.6974 9.2919 7.7281 4.5523 2.8997 7.9288 26.1532 0.7221 2.8281 0.1480 15.7774 3.7695 41.2229 11.5170 1.0043 1.3621 2.8720 0.0383 2.0827 43.6669 35.6008 2.2421 0.3157 0.0583 1.3762 4.4585 4.2018 2.8011 0.0384 11.0440 14.6243 7.5677 11.4349 11.5351 3.6866 4.0162 6.7411 0.3386 0.1489 60.5196 121.9723 34.7294 42.3923 26.0855 27.6612 34.4398 63.2024 68.9660 23.5794 47.3624 51.2269 26.0427 0.0382 7.3823 17.3391 26.1755 17.2269 4.8902
temp: 298.150 k
press: 1.00000 atm
elementType: 8 8 7 6 6 6 6 6 6 6 6 6 6 6 6 6 6 1 1 1 1 1 1 1 1 1 1 1 1 1 1 1 1 1 1 1
symmnumber: 1
zpe: 802871.2 jmol-1
zpe.correction: 0.305797 hartree
zpe.thermalcorrener: 0.320834 hartree
zpe.thermalcorrenthalpy: 0.321778 hartree
zpe.thermalcorrgfe: 0.261439 hartree
zpe.sumelectzpe: -748.766666 hartree
zpe.sumelectthermal: -748.751630 hartree
zpe.sumelectthermalent: -748.750686 hartree
zpe.sumelectthermalfe: -748.811025 hartree
dipole: -0.5145 1.5706 1.9453
dipole: 2.5526
quadrupole: -98.9796 -100.7035 -100.2418
quadrupole: 1.6107 0.8695 -2.3291
quadrupole: 0.9954 -0.7285 -0.2668 1.6107 0.8695 -2.3291
hfenergy: -749.0724639 hartree
pointgroup: C01 [X(C14H19N1O2)]
dipole: 0.1684535 -0.3840744 0.9124876 debye
polarizability: 175.6563214|-1.029782|157.634598|-14.5130622|-4.1283753|126.7569623 unknown
InChI: InChI=1S/C14H19NO2/c1-2-6-11(7-3-1)14-16-10-13(17-14)12-8-4-5-9-15-12/h1-3,6-7,12-15H,4-5,8-10H2
charge 0 multiplicity 1
36 atoms
O  0.094374 0.630987 -1.741048
O  -0.97124 2.444687 -0.700851
N  2.913013 0.803351 0.776147
C  1.881452 0.155324 -0.076179
C  1.102943 1.253711 -0.825665
C  2.576566 -0.810586 -1.061972
C  3.448386 -1.84226 -0.311465
C  4.466818 -1.124141 0.604895
C  3.733435 -0.156768 1.556569
C  0.253399 2.181744 0.086383
C  -1.228544 1.170524 -1.385155
C  -2.034119 0.199066 -0.519452
C  -1.779896 -1.192739 -0.563182
C  -3.08718 0.691975 0.290888
C  -2.567666 -2.084049 0.200434
C  -3.872085 -0.1995 1.056092
C  -3.615522 -1.590162 1.011644
H  1.14546 -0.434751 0.530993
H  1.802014 1.832386 -1.456959
H  3.216498 -0.213169 -1.741597
H  1.80823 -1.309477 -1.679421
H  3.971528 -2.497785 -1.033093
H  2.798118 -2.49745 0.305495
H  2.50952 1.528397 1.386256
H  5.049088 -1.855874 1.197221
H  5.178819 -0.544904 -0.014273
H  3.113662 -0.762985 2.266028
H  4.46224 0.41806 2.157637
H  -0.007505 1.674655 1.038975
H  0.71721 3.159689 0.282859
H  -1.753149 1.423326 -2.323221
H  -0.963426 -1.562425 -1.192161
H  -3.273806 1.77098 0.326657
H  -2.36417 -3.160315 0.162762
H  -4.681359 0.188712 1.684919
H  -4.226307 -2.281333 1.603541
