program: Gaussian 09
title: 000285479
version: EM64L-G09RevD.01
frameworkgroup: C1[X(C14H15NO3)]
method: RPBEPBE
basis: SDD
operation: Freq
keyword: #p
keyword: freq=noraman
keyword: PBEPBE/SDD
title: #p freq=noraman PBEPBE/SDD
converged: YES YES NO NO
title: Mulliken charges:
elementType: O O O N C C C C C C C C C C C C C C H H H H H H H H H H H H H H H
charge: -0.248461 -0.282259 -0.244535 -0.229958 0.264538 0.217714 0.405680 -0.536963 0.164384 -0.486954 -0.336674 -0.376105 -0.813160 -0.252647 -0.271782 0.279442 -0.259070 -0.660846 0.294851 0.270244 0.252278 0.265609 0.244542 0.239434 0.237073 0.236959 0.233730 0.232479 0.233766 0.225217 0.217351 0.236326 0.247800
chargesum: 0.00000
title: Mulliken charges with hydrogens summed into heavy atoms:
elementType: O O O N C C C C C C C C C C C C C C
charge: -0.248461 -0.282259 -0.244535 -0.229958 0.264538 0.217714 0.405680 0.028131 0.164384 -0.234677 -0.071065 -0.131563 -0.099694 -0.018917 -0.039304 0.279442 0.199913 0.040631
polarizability: 1.89056842e+02 -1.11051164e+01 2.04411323e+02 -2.68887645e+01 7.68998831e-01 1.17368637e+02
1716.lowfreq: -2.8346 -0.0008 -0.0006 0.0002 6.7961 10.2911 32.0925 34.5527 45.1928
frequency: 32.0270 34.4741 45.1552 75.2733 88.1022 106.9892 129.8904 167.6384 187.3937 207.8626 231.8647 272.5301 283.4657 315.8054 324.9752 336.3923 388.6835 419.2187 425.9276 443.9291 500.4122 510.3281 533.6727 564.6618 586.0193 588.5864 654.5543 665.2386 697.2998 729.4697 755.7147 761.3806 767.5990 806.7421 822.6505 863.3353 881.5351 890.8360 901.7833 948.4824 985.6737 999.5197 1013.0884 1020.8554 1045.9109 1046.6866 1072.7150 1097.0783 1109.3702 1156.8377 1165.1525 1182.2582 1189.9721 1212.6372 1239.5482 1277.1893 1279.8695 1303.4565 1317.1423 1355.6662 1366.9121 1375.7677 1393.3788 1397.0105 1405.6528 1447.9078 1449.9027 1458.5772 1463.9325 1467.9321 1471.8335 1484.6133 1494.9518 1561.6975 1568.9906 1618.7136 1628.0870 1647.9438 2979.5091 2982.4517 2994.9092 3031.3363 3056.1641 3077.0650 3090.5680 3096.5489 3099.8939 3122.3832 3136.3252 3148.3672 3164.4357 3170.4622 3175.1645
redmass: 4.9461 3.8426 4.7042 3.8888 5.3472 4.4388 3.5189 2.9956 1.2959 1.3303 3.0057 3.0029 2.5893 3.1035 5.1257 5.7597 4.0687 3.1612 3.1441 5.9792 5.2699 5.2157 3.3906 4.9202 4.0517 3.7225 6.4776 3.7816 4.1701 4.6860 3.1211 1.6424 2.3818 2.1056 2.1101 1.4744 1.4410 3.2220 2.9878 1.3702 1.3211 1.7911 3.1179 3.4710 1.7788 2.5473 1.9733 2.1645 3.8385 1.6513 1.6780 1.2523 2.7906 2.8631 1.4982 1.1580 1.4368 2.6005 1.5409 1.2987 1.7273 2.7373 1.2307 1.3199 5.5630 1.6689 1.4963 1.0981 1.0426 1.0461 1.1090 1.0524 2.9680 6.1992 7.1070 6.3487 9.2246 7.5428 1.0383 1.0640 1.0363 1.0598 1.0972 1.0955 1.0975 1.1029 1.0982 1.1062 1.0855 1.0896 1.0945 1.0925 1.0994
irintensity: 1.6557 0.5218 0.9277 1.0079 2.5803 1.6507 0.5660 0.4844 0.2310 1.9774 5.0362 0.5615 3.7769 0.8393 9.0491 6.0267 8.4861 7.9552 4.2439 3.6402 11.4091 3.5358 4.5044 6.9305 5.0301 2.2063 3.9308 4.7373 7.4427 10.0018 4.0251 76.1068 18.7440 2.3529 3.1680 6.2325 20.4645 21.5750 27.1826 3.2236 0.3912 4.8919 57.3624 43.2248 2.0605 9.9932 8.3765 13.1480 12.9740 12.6051 10.5916 2.0791 164.2396 75.1699 50.1604 3.3297 7.9267 43.9915 17.4973 1.3471 35.0591 36.4625 25.1687 20.3575 4.8281 7.9783 103.6077 11.7328 14.6681 15.8804 9.2960 11.3204 16.8910 50.7323 160.7985 2.6171 215.6701 263.3918 24.5090 46.4647 17.6102 22.3748 14.9129 9.5127 28.4763 1.5634 19.5113 25.7495 0.6305 9.3483 22.1433 4.5931 12.4152
temp: 298.150 k
press: 1.00000 atm
elementType: 8 8 8 7 6 6 6 6 6 6 6 6 6 6 6 6 6 6 1 1 1 1 1 1 1 1 1 1 1 1 1 1 1
symmnumber: 1
zpe: 688139.4 jmol-1
zpe.correction: 0.262098 hartree
zpe.thermalcorrener: 0.278810 hartree
zpe.thermalcorrenthalpy: 0.279754 hartree
zpe.thermalcorrgfe: 0.216635 hartree
zpe.sumelectzpe: -821.634916 hartree
zpe.sumelectthermal: -821.618204 hartree
zpe.sumelectthermalent: -821.617260 hartree
zpe.sumelectthermalfe: -821.680378 hartree
dipole: -2.7086 2.4085 2.8686
dipole: 4.6224
quadrupole: -93.2917 -110.3718 -103.2965
quadrupole: 0.2881 3.5894 -2.6638
quadrupole: 9.0283 -8.0518 -0.9765 0.2881 3.5894 -2.6638
hfenergy: -821.897014 hartree
pointgroup: C01 [X(C14H15N1O3)]
dipole: -1.250535 -1.0341809 -0.8209213 debye
polarizability: 196.0782766|13.3619737|201.5168667|13.3877071|-14.1555502|113.2416583 unknown
InChI: InChI=1S/C14H15NO3/c1-3-18-14(17)9-15-12-7-5-4-6-11(12)10(2)8-13(15)16/h4-8H,3,9H2,1-2H3
charge 0 multiplicity 1
33 atoms
O  2.079133 -0.146716 -1.130133
O  0.670155 2.919408 0.421286
O  3.237862 -1.193229 0.607456
N  0.083927 0.653855 0.629585
C  -0.850005 -0.390648 0.503823
C  -2.167503 -0.107425 -0.000415
C  -2.505257 1.262433 -0.381749
C  1.440594 0.397282 1.133129
C  -0.209139 2.009618 0.273725
C  -1.552728 2.250258 -0.239814
C  -0.513061 -1.724153 0.874245
C  -3.100163 -1.177444 -0.112494
C  -3.882096 1.589783 -0.921799
C  -1.459521 -2.755725 0.752675
C  -2.761568 -2.488432 0.257534
C  2.342316 -0.414941 0.202453
C  2.963702 -0.814388 -2.13979
C  4.222488 0.021899 -2.38117
H  1.900226 1.399046 1.256727
H  1.42324 -0.106629 2.113649
H  -1.76224 3.288828 -0.510739
H  0.482863 -1.962924 1.256841
H  -4.103408 -0.967403 -0.496203
H  -3.963605 2.662047 -1.162044
H  -4.672022 1.343454 -0.187393
H  -4.101427 1.016095 -1.841971
H  -1.181829 -3.774292 1.044687
H  -3.493261 -3.297153 0.164891
H  3.211722 -1.826093 -1.773321
H  2.325697 -0.876397 -3.035347
H  4.817762 -0.430207 -3.196105
H  3.958573 1.051981 -2.675321
H  4.850578 0.057911 -1.475396
