program: Gaussian 09
title: 000285476
version: EM64L-G09RevD.01
frameworkgroup: C1[X(C12H16N4O3)]
method: RPBEPBE
basis: SDD
operation: Freq
keyword: #p
keyword: freq=noraman
keyword: PBEPBE/SDD
title: #p freq=noraman PBEPBE/SDD
converged: YES YES NO NO
title: Mulliken charges:
elementType: O O O N N N N C C C C C C C C C C C C H H H H H H H H H H H H H H H H
charge: -0.245589 -0.257415 -0.495304 -0.461065 -0.458946 -0.644633 -0.134824 0.587097 -0.655249 0.562014 0.547432 -0.591640 -0.579751 -0.730040 0.245614 0.212465 0.210191 -0.800979 -0.799348 0.243283 0.232552 0.316674 0.325114 0.213367 0.307541 0.309261 0.349655 0.336002 0.235767 0.271778 0.236376 0.237893 0.271352 0.236373 0.366986
chargesum: 0.00000
title: Mulliken charges with hydrogens summed into heavy atoms:
elementType: O O O N N N N C C C C C C C C C C C C
charge: -0.245589 -0.257415 -0.128318 -0.153524 -0.149686 0.041024 -0.134824 0.587097 -0.179414 0.562014 0.547432 -0.274966 -0.254637 -0.516673 0.245614 0.212465 0.210191 -0.057058 -0.053731
polarizability: 2.45453989e+02 4.18266551e+00 1.97857639e+02 4.98621033e+00 1.25667320e+01 1.03943458e+02
1716.lowfreq: -75.6152 -66.4456 -5.0385 -0.0010 -0.0007 -0.0005 3.2872 6.0483 14.3651
frequency: -75.6123 -66.4379 14.1949 34.4840 41.1603 53.4230 57.4447 87.2604 103.1251 109.5902 142.9990 216.7915 235.9610 241.1452 255.7484 256.7730 267.2485 299.1091 318.2041 332.9609 359.1263 373.0740 442.5984 447.3580 510.0084 514.2021 535.1643 544.1969 565.0184 582.1700 587.5897 604.0851 620.6295 630.8221 661.0957 678.6032 688.1117 709.3115 749.8936 838.7861 854.8793 879.6544 883.3178 919.2735 937.5479 942.5011 950.6799 963.7177 965.6928 982.4963 1019.1941 1030.5849 1031.2876 1047.7840 1060.9153 1162.0673 1170.3945 1186.1182 1233.5161 1237.4562 1264.4727 1294.5662 1298.7307 1336.6936 1375.2193 1377.2797 1389.2122 1392.8609 1402.8012 1443.6787 1452.1895 1463.3948 1464.2546 1468.4412 1469.0665 1513.6802 1537.4828 1583.7820 1614.1406 1617.9796 1633.7166 1639.3388 1641.8624 2987.3960 2987.6788 2996.9046 3072.6509 3072.7028 3083.3285 3093.8001 3136.8708 3137.2401 3175.5427 3189.3100 3522.3034 3524.3968 3540.9987 3608.9286 3689.5685
redmass: 1.0540 1.0649 5.6901 5.4535 6.7176 5.0051 4.5630 4.1816 3.9055 4.4219 4.6515 5.7981 10.0571 4.5909 3.8091 4.0673 5.3543 3.0979 1.9124 1.6252 3.6639 3.2011 1.3098 3.1502 3.0011 3.8345 4.1396 2.1382 3.0049 2.7811 3.9436 1.8343 2.0343 1.1902 1.9957 2.7748 5.1535 3.3231 3.4868 7.1529 1.7922 3.4107 3.3763 6.8204 1.5782 1.4837 1.9450 2.1692 2.1103 6.1409 2.4815 1.6630 1.6583 2.2369 1.5795 1.2217 1.3693 1.7272 2.0885 2.6536 1.3333 1.3321 1.3810 2.9846 1.2344 1.2348 7.0775 4.5429 3.7340 1.2700 1.1038 1.6589 1.3972 1.0470 1.0472 1.7466 2.3768 1.3168 5.5427 6.1262 4.8881 4.8442 4.3080 1.0384 1.0385 1.0650 1.0984 1.0984 1.0965 1.0911 1.0978 1.0978 1.0927 1.0934 1.0764 1.0764 1.0435 1.0678 1.1050
irintensity: 0.0012 0.0043 1.1520 0.8818 10.1648 1.0959 8.6962 3.6356 0.0579 0.4565 9.3940 4.3923 1.3880 8.4016 0.2216 2.7991 0.9105 5.5095 69.6624 131.9747 8.7427 1.6659 131.5645 4.4316 34.1499 13.6541 11.7091 41.2446 0.2556 6.8949 38.7289 0.7527 50.9126 110.1824 0.7784 12.1724 4.5144 21.8667 18.0069 77.3698 52.9783 3.8538 9.1321 0.7983 45.3211 6.2362 14.7928 29.0863 29.3057 0.0970 16.0457 6.6970 8.1031 6.0211 70.6809 16.6977 8.7935 0.4161 168.4939 41.4405 54.8599 97.5945 1.6930 7.3260 41.9833 42.4220 257.6764 11.3565 3.2876 312.0592 13.4870 181.0791 143.0821 19.4956 21.1017 196.2368 75.0205 67.4945 154.9793 299.0238 94.0433 39.5265 192.8049 8.6052 9.5739 18.2906 10.2221 20.4192 3.9158 19.2459 6.8338 6.3141 9.3641 9.3816 8.7134 10.6662 31.7123 45.0871 67.1860
temp: 298.150 k
press: 1.00000 atm
elementType: 8 8 8 7 7 7 7 6 6 6 6 6 6 6 6 6 6 6 6 1 1 1 1 1 1 1 1 1 1 1 1 1 1 1 1
symmnumber: 1
zpe: 721725.1 jmol-1
zpe.correction: 0.274891 hartree
zpe.thermalcorrener: 0.293558 hartree
zpe.thermalcorrenthalpy: 0.294502 hartree
zpe.thermalcorrgfe: 0.225560 hartree
zpe.sumelectzpe: -910.143950 hartree
zpe.sumelectthermal: -910.125282 hartree
zpe.sumelectthermalent: -910.124338 hartree
zpe.sumelectthermalfe: -910.193280 hartree
dipole: -2.7099 -8.0303 -2.8544
dipole: 8.9430
quadrupole: -114.6515 -90.0875 -111.3365
quadrupole: 4.8411 -0.6359 3.2148
quadrupole: -9.2930 15.2710 -5.9780 4.8411 -0.6359 3.2148
hfenergy: -910.4188401 hartree
pointgroup: C01 [X(C12H16N4O3)]
dipole: -0.8810316 -3.1996634 -1.1684957 debye
polarizability: 244.7809834|6.6687543|198.1366094|5.2221276|14.0439298|104.3374931 unknown
InChI: InChI=1S/C12H16N4O3/c1-7(17)14-10-3-9(5-12(13)16-19)4-11(6-10)15-8(2)18/h3-4,6,14-15,19H,5,13H2,1-2H3
charge 0 multiplicity 1
35 atoms
O  3.963828 -0.951559 0.369355
O  -4.150956 0.127768 0.184886
O  1.310042 4.906614 -0.952145
N  2.110053 -2.251299 -0.263542
N  -2.703472 -1.686784 -0.182237
N  -0.627388 3.216641 -0.814013
N  1.395354 3.9755 0.224982
C  0.037911 0.719726 0.789347
C  0.20712 2.151424 1.292227
C  1.015682 -1.386781 0.027123
C  -1.425861 -1.104913 0.067315
C  -1.264671 0.209787 0.575635
C  1.181088 -0.066985 0.519784
C  -0.286148 -1.899881 -0.201344
C  0.342064 3.166299 0.164668
C  3.481843 -2.023105 -0.094723
C  -3.964876 -1.084555 -0.126667
C  4.35365 -3.203796 -0.527972
C  -5.112443 -2.029966 -0.48594
H  1.111008 2.248107 1.916034
H  -0.664638 2.433205 1.91406
H  -2.15201 0.802805 0.80851
H  2.186451 0.325361 0.682661
H  -0.410686 -2.921117 -0.589374
H  1.85681 -3.16706 -0.642396
H  -2.691091 -2.669385 -0.466153
H  -0.515383 3.906597 -1.554568
H  -1.362166 2.516136 -0.862898
H  4.124687 -4.11162 0.060829
H  5.407336 -2.9358 -0.366625
H  4.207905 -3.440574 -1.598366
H  -5.026803 -2.386237 -1.52951
H  -6.060398 -1.484202 -0.37795
H  -5.133353 -2.913244 0.179077
H  2.132508 5.442995 -0.838568
