program: Gaussian 09
title: 000285462
version: EM64L-G09RevD.01
frameworkgroup: C1[X(C11H14O)]
method: RPBEPBE
basis: SDD
operation: Freq
keyword: #pfreq=noraman
keyword: PBEPBE/SDD
title: #p freq=noraman PBEPBE/SDD
converged: YES YES NO NO
title: Mulliken charges:
elementType: O C C C C C C C C C C C H H H H H H H H H H H H H H
charge: -0.202109 0.090721 0.431215 -0.698525 -0.775608 0.171870 -0.389857 -0.413776 -0.786087 -0.242516 -0.238595 -0.243796 0.212402 0.222430 0.239393 0.231166 0.232604 0.224545 0.254710 0.246879 0.254426 0.253040 0.242948 0.227547 0.225033 0.229940
chargesum: 0.00000
title: Mulliken charges with hydrogens summed into heavy atoms:
elementType: O C C C C C C C C C C C
charge: -0.202109 0.090721 0.431215 -0.024299 -0.087293 0.171870 -0.135147 -0.166897 -0.035674 -0.014969 -0.013562 -0.013857
polarizability: 1.43358763e+02 -7.55330519e-01 1.14736337e+02 7.60893899e+00 9.88953729e+00 8.81400498e+01
1716.lowfreq: -3.2126 -0.0009 -0.0006 0.0004 8.7617 18.2391 45.5119 52.8855 94.9157
frequency: 45.1867 52.8728 94.8846 137.3045 181.3858 200.6467 243.6850 249.0377 299.5819 311.9764 344.8286 367.5074 404.3880 423.6707 451.3006 540.0999 564.2158 613.3175 618.2660 669.8654 707.3543 762.6920 781.2993 855.5298 903.6711 924.8231 944.7748 952.9967 979.8400 989.6049 996.5759 1004.8857 1024.8560 1026.6320 1081.9782 1099.9719 1128.2475 1171.6554 1175.8243 1197.8844 1223.1602 1240.2831 1323.2643 1367.3829 1375.8366 1382.8704 1399.9703 1433.0542 1444.2848 1457.3182 1459.9304 1464.4145 1483.5686 1487.4983 1490.8114 1588.1493 1607.2218 1620.5038 2983.9592 2986.5922 2993.7222 3075.5270 3077.5467 3086.3466 3090.0326 3107.8642 3119.1678 3119.8606 3126.2973 3139.7152 3152.3895 3164.8551
redmass: 4.0487 4.7393 3.9381 1.0444 3.0763 1.0539 2.3879 3.0369 2.0211 1.6402 2.1126 4.6626 2.8133 3.2178 3.1933 3.0896 3.4862 3.8383 4.1578 4.2042 1.6715 2.3610 2.1574 1.2454 2.2838 1.4805 1.4875 1.6671 1.3861 5.9368 1.3155 1.4324 1.6387 2.4928 1.7006 2.0162 2.2679 1.6065 1.5814 1.1207 3.3907 3.5037 1.3588 1.2340 5.2878 1.2522 1.1917 2.1441 1.0862 1.0572 1.0775 1.0529 2.0190 1.0653 1.0545 5.9789 6.1944 8.2826 1.0355 1.0376 1.0357 1.0952 1.0984 1.0999 1.1005 1.0987 1.0869 1.1004 1.0871 1.0927 1.0945 1.1007
irintensity: 1.1941 3.6110 0.1346 0.1954 0.4300 0.3371 2.4851 2.5286 0.0218 0.1938 0.8137 2.7853 0.0053 0.7465 0.2918 16.1883 12.4419 0.5554 0.4133 0.2162 55.5712 18.6894 28.8391 0.1178 1.2333 1.1729 1.8283 19.0000 0.0090 0.2900 0.2961 0.1771 6.2850 13.1228 10.0514 15.9497 53.2762 0.0887 0.4261 0.3644 26.3581 17.8359 0.8790 53.3874 4.3952 24.2353 14.6918 13.7307 17.5321 12.5675 0.9587 6.3980 24.1713 16.1312 11.7514 6.4712 45.3534 95.6350 13.7956 9.3482 24.2013 8.7667 20.4807 25.5616 39.5504 21.2890 1.6813 14.5002 0.4300 19.3477 34.5285 18.4045
temp: 298.150 k
press: 1.00000 atm
elementType: 8 6 6 6 6 6 6 6 6 6 6 6 1 1 1 1 1 1 1 1 1 1 1 1 1 1
symmnumber: 1
zpe: 571806.1 jmol-1
zpe.correction: 0.217789 hartree
zpe.thermalcorrener: 0.230048 hartree
zpe.thermalcorrenthalpy: 0.230992 hartree
zpe.thermalcorrgfe: 0.179489 hartree
zpe.sumelectzpe: -501.895204 hartree
zpe.sumelectthermal: -501.882945 hartree
zpe.sumelectthermalent: -501.882001 hartree
zpe.sumelectthermalfe: -501.933504 hartree
dipole: 1.5989 2.1244 1.3236
dipole: 2.9701
quadrupole: -73.4660 -70.7719 -72.5933
quadrupole: -7.0993 -1.9282 0.7830
quadrupole: -1.1889 1.5052 -0.3162 -7.0993 -1.9282 0.7830
hfenergy: -502.1129932 hartree
pointgroup: C01 [X(C11H14O1)]
dipole: 0.6379575 0.8219882 0.5317833 debye
dipolederiv: -0.57639 -0.2759987 -0.0927806 -0.4082123 -0.5711622 -0.0908677 -0.0855271 -0.062204 -0.600234 -0.1249909 -0.1738143 0.043587 -0.2419022 -0.0815699 0.0735532 -0.0308946 0.078366 -0.0149701 0.3670595 -0.0241898 0.0385235 -0.119118 -0.0799878 0.0025946 0.1144415 0.0155621 -0.0857065 -0.048055 0.0320226 -0.0204699 0.0408937 0.0209264 -0.0167958 0.0340219 -0.0446852 -0.0371087 -0.0050719 -0.0004192 0.0263596 0.0341073 -0.0120678 -0.0358796 0.0327919 0.0066724 -0.0006662 0.5878239 0.4894806 -0.035061 0.7226868 0.5719688 -0.0379697 -0.1412478 -0.0720317 0.9466584 -0.1542594 0.0739075 0.0401076 0.0959045 -0.0374899 0.054123 0.0545235 0.0514055 -0.1225561 -0.1903691 -0.0272885 -0.0008971 -0.0316865 0.0398853 0.0523059 0.0131144 0.0460183 -0.1373565 0.0217942 -0.0431646 0.0738048 -0.0557062 -0.0067851 -0.009579 0.0899718 0.0070868 -0.5188127 0.0085232 -0.0444846 0.0096502 -0.0599004 0.1075517 0.0671293 0.0064193 0.0716829 -0.1247726 0.0252769 0.063663 0.052089 0.0921445 0.0418729 0.0734832 0.0546756 0.0643118 -0.1073539 0.0525644 -0.043259 0.0342717 -0.0588958 -0.0884039 0.0171176 0.0252865 0.0178765 -0.1549463 0.0384583 -0.0996229 0.076859 -0.081561 -0.0271622 0.1060846 0.0531924 0.0534958 0.0110895 -0.1602662 0.0641465 -0.0729995 0.0581885 0.0888157 0.0072577 -0.0560456 0.013957 0.0557551 0.0930125 0.0544259 0.0189974 0.053468 -0.0704308 -0.0984453 0.0381072 -0.0433492 0.0535511 0.0872115 -0.016427 -0.0640685 0.0106058 0.0739909 -0.0308226 -0.0429284 -0.0403759 -0.1430086 -0.1589777 0.0755296 -0.0188111 0.0133498 0.0847953 -0.0069137 -0.038944 0.0020813 0.0919849 0.0578267 -0.1087819 0.0593778 -0.0759416 -0.0565433 0.0728183 0.0644264 0.0804586 0.0234987 0.0202887 -0.0864772 -0.0536133 -0.0759329 0.0367442 -0.0459834 -0.0520088 -0.0496644 0.112257 0.1018197 0.0661205 0.010171 0.0657856 -0.0662416 -0.0523056 0.0108903 -0.0472826 0.1185116 -0.062913 -0.0472364 -0.076662 -0.0609083 0.0836738 -0.0073769 -0.0557403 -0.018631 0.0952776 0.0973598 -0.0470253 0.0094284 -0.0684238 -0.0522492 0.102808 0.01395 0.0393646 0.0494328 0.0194942 0.0867197 0.0319124 0.1102314 0.0140979 -0.0512029 -0.0032983 -0.0262754 0.0828363 0.0489812 0.0630838 0.0022827 0.0843668 -0.0866301 -0.0608759 0.0061571 -0.0617691 0.1352192 -0.0215019 -0.0835639 -0.0561081 -0.0984984 -0.0125872 -0.0705076 -0.0684566 -0.0688458 0.1216819 -0.1246996 0.0526535 -0.0359511 0.0549547 0.0849881 -0.0137497 -0.0368782 -0.0132256 0.1497381 unknown
polarizability: 143.2151796|-1.3241751|114.6111108|8.1428888|9.9706618|88.4088591 unknown
InChI: InChI=1S/C11H14O/c1-9(12)11(2,3)10-7-5-4-6-8-10/h4-8H,1-3H3
charge 0 multiplicity 1
26 atoms
O  -2.621405 -1.402645 -0.236027
C  -1.103925 0.532832 -0.391826
C  0.397948 0.224333 -0.172301
C  -1.432513 0.462468 -1.907549
C  -1.519472 1.927787 0.152367
C  -1.919145 -0.555104 0.37596
C  0.884837 -1.074707 -0.487421
C  1.320359 1.185703 0.31202
C  -1.845853 -0.551569 1.900134
C  2.24783 -1.400655 -0.324962
C  2.688887 0.863411 0.469702
C  3.159374 -0.43004 0.153219
H  -0.837476 1.214962 -2.455209
H  -2.506036 0.655465 -2.080097
H  -1.207671 -0.533752 -2.320842
H  -1.276477 2.057427 1.221472
H  -2.607378 2.073664 0.025077
H  -1.009966 2.727108 -0.415493
H  0.189248 -1.837317 -0.858711
H  0.982247 2.195125 0.566526
H  -0.837047 -0.289071 2.261477
H  -2.142335 -1.539244 2.287162
H  -2.553149 0.199451 2.302652
H  2.598942 -2.409281 -0.570715
H  3.3856 1.624305 0.840094
H  4.218973 -0.679455 0.277893
