program: Gaussian 09
title: 000285472
version: EM64L-G09RevD.01
frameworkgroup: C1[X(C13H8Cl2N4)]
method: RPBEPBE
basis: SDD
operation: Freq
keyword: #p
keyword: freq=noraman
keyword: PBEPBE/SDD
title: #p freq=noraman PBEPBE/SDD
converged: YES YES NO NO
title: Mulliken charges:
elementType: Cl Cl N N N N C C C C C C C C C C C C C H H H H H H H H
charge: 0.025622 0.025021 -0.289250 0.046081 0.042133 0.132584 0.270820 0.470034 -0.205939 -0.341335 -0.282770 0.042985 -0.354662 -0.371350 -0.201930 -0.212478 -0.234554 -0.296048 -0.288923 0.272396 0.288233 0.256035 0.252739 0.253875 0.233622 0.232826 0.234234
chargesum: 0.00000
title: Mulliken charges with hydrogens summed into heavy atoms:
elementType: Cl Cl N N N N C C C C C C C C C C C C C
charge: 0.025622 0.025021 -0.289250 0.046081 0.042133 0.132584 0.270820 0.470034 0.066457 -0.053102 -0.026735 0.042985 -0.101922 -0.117475 0.031692 0.020348 -0.000320 -0.296048 -0.288923
polarizability: 2.52136503e+02 -5.68645580e-01 2.39685451e+02 -1.38463633e+01 -4.98096830e+00 1.03578756e+02
1716.lowfreq: -7.3706 -0.0024 -0.0008 -0.0007 2.1279 3.4304 16.0983 19.8876 49.7534
frequency: 15.9975 19.1477 49.7404 83.7695 106.4335 111.4116 139.2781 164.5842 180.1779 219.0707 229.5526 288.4094 342.5498 364.8339 396.2998 406.4590 413.3688 432.4413 515.6946 574.8101 595.6558 603.3486 621.5862 634.0379 680.3318 690.4797 697.4978 746.3451 761.6717 773.6180 787.6578 797.4691 842.6896 848.1693 873.3061 883.2517 912.9178 920.1301 961.4222 973.9501 989.9457 997.0034 1022.0506 1045.9005 1079.3066 1083.2577 1124.0076 1138.2382 1174.0745 1181.0537 1184.3615 1204.9718 1248.3192 1286.8385 1299.0094 1317.6633 1367.7802 1383.3107 1404.3963 1428.5950 1442.7458 1463.4499 1467.1255 1487.3183 1575.2418 1600.4608 1610.9139 3134.0860 3141.9054 3152.7607 3161.6419 3173.7924 3219.0479 3235.5549 3250.2093
redmass: 10.3480 4.2404 6.2499 7.5669 5.5655 6.1409 14.8631 11.9193 15.7466 6.5771 6.3467 6.2087 6.7589 8.8093 8.1502 2.9391 6.7529 16.2923 4.8689 4.6581 3.2829 6.3303 11.8370 5.7192 6.3198 4.4848 2.3270 5.1169 1.2595 1.9617 12.1829 7.7091 1.2700 1.4736 5.6271 12.9393 1.3665 1.4070 4.1230 1.3814 5.6439 1.3492 2.0692 1.4051 1.5762 1.4724 4.3492 7.7937 1.0534 1.3777 3.6440 1.9824 8.6114 3.1732 3.2653 1.5507 10.4877 9.6072 7.4492 3.7532 2.3101 3.6673 10.8741 2.8353 8.6350 6.7209 6.2727 1.0851 1.0885 1.0929 1.0974 1.1019 1.0905 1.0978 1.1086
irintensity: 0.0088 0.0902 0.5555 0.6658 0.2771 0.2879 0.0685 0.2456 0.1519 0.7157 0.6932 0.6727 4.6664 3.1121 1.9185 0.1142 2.0749 9.0592 7.4318 5.6333 7.3072 0.6119 0.1561 1.7067 13.5608 11.1887 40.5926 26.3379 109.6017 92.0852 173.0603 5.7002 1.0007 2.7902 0.1952 16.7734 1.5228 5.9843 7.9226 0.1645 2.2988 0.1636 5.5672 53.8665 15.4478 11.0382 40.8251 48.2272 0.0546 73.5261 188.6557 19.2542 112.3238 23.9777 3.4047 4.6048 579.9805 3.9658 190.6762 49.4727 5.0531 155.3443 868.0638 70.0210 404.3987 11.5097 19.2779 0.7791 2.5071 19.8890 20.7507 10.4832 3.4669 0.7344 1.1261
temp: 298.150 k
press: 1.00000 atm
elementType: 17 17 7 7 7 7 6 6 6 6 6 6 6 6 6 6 6 6 6 1 1 1 1 1 1 1 1
symmnumber: 1
zpe: 482908.0 jmol-1
zpe.correction: 0.183930 hartree
zpe.thermalcorrener: 0.199507 hartree
zpe.thermalcorrenthalpy: 0.200451 hartree
zpe.thermalcorrgfe: 0.137635 hartree
zpe.sumelectzpe: -1637.983619 hartree
zpe.sumelectthermal: -1637.968042 hartree
zpe.sumelectthermalent: -1637.967098 hartree
zpe.sumelectthermalfe: -1638.029914 hartree
dipole: 5.4123 1.9065 0.1929
dipole: 5.7415
quadrupole: -122.0467 -117.5457 -118.4141
quadrupole: -3.8515 -2.0427 -3.5113
quadrupole: -2.7111 1.7898 0.9214 -3.8515 -2.0427 -3.5113
hfenergy: -1638.1675488 hartree
pointgroup: C01 [X(C13H8Cl2N4)]
dipole: -2.1405638 0.7055176 0.1506526 debye
polarizability: 246.5302641|-0.1487702|239.8429439|-31.5177741|-2.0749616|109.0275011 unknown
InChI: InChI=1S/C13H8Cl2N4/c14-12-16-11(17-13(15)18-12)10-7-4-8-19(10)9-5-2-1-3-6-9/h1-8H
charge 0 multiplicity 1
27 atoms
Cl 5.168752 0.35659 -0.829255
Cl 1.550774 -3.436572 0.358845
N  -1.129035 1.349066 0.113834
N  0.924791 -0.832213 0.108167
N  2.55975 0.882954 -0.442177
N  3.246071 -1.433176 -0.23849
C  0.260901 1.524567 -0.103665
C  -1.904994 0.124858 0.157879
C  -1.716273 2.605034 0.198111
C  0.509695 2.920709 -0.15601
C  -0.724665 3.593917 0.038119
C  1.257956 0.485957 -0.150081
C  -1.990452 -0.699976 -0.985193
C  -2.621053 -0.190279 1.33308
C  -2.788266 -1.86181 -0.94212
C  -3.425479 -1.351627 1.365705
C  -3.508235 -2.190034 0.231241
C  3.461487 -0.106093 -0.462017
C  1.94481 -1.70207 0.040737
H  -2.792343 2.698956 0.331313
H  1.498148 3.352086 -0.298078
H  -0.891948 4.668811 0.056828
H  -1.433291 -0.435877 -1.889511
H  -2.527673 0.453219 2.214355
H  -2.850489 -2.509001 -1.823305
H  -3.976098 -1.60405 2.278112
H  -4.126443 -3.093643 0.260575
