program: Gaussian 09
title: 000285436
version: EM64L-G09RevD.01
frameworkgroup: C1[X(C6H6BrNO)]
method: RPBEPBE
basis: SDD
operation: Freq
keyword: #p
keyword: freq=noraman
keyword: PBEPBE/SDD
title: #p freq=noraman PBEPBE/SDD
converged: NO YES NO YES
title: Mulliken charges:
elementType: Br O N C C C C C C H H H H H H
charge: 0.021126 -0.267862 -0.348103 0.282852 0.060321 -0.232265 -0.763549 -0.144303 -0.190041 0.258841 0.249664 0.249738 0.212997 0.341026 0.269558
chargesum: 0.00000
title: Mulliken charges with hydrogens summed into heavy atoms:
elementType: Br O N C C C C C C
charge: 0.021126 -0.267862 -0.007077 0.282852 0.060321 0.026576 -0.051149 -0.144303 0.079517
polarizability: 1.42665983e+02 5.09552894e-01 8.67361320e+01 5.09824278e-03 4.75916453e-03 3.85709466e+01
1716.lowfreq: -8.5313 -4.6446 0.0003 0.0004 0.0005 2.8690 95.6974 112.9623 177.5343
frequency: 95.6933 112.8800 177.5291 181.2696 273.7081 292.2042 299.9352 404.8874 461.5349 527.8417 543.2942 606.1170 705.1647 735.0191 765.8516 858.2826 887.8072 895.9908 992.2619 1047.0934 1085.5671 1096.6145 1217.0249 1235.8843 1327.6660 1376.7411 1399.7689 1407.1952 1446.0197 1464.5735 1558.8394 1594.0201 1641.7608 2985.6090 3063.5752 3101.1737 3148.6798 3190.5503 3511.7074
redmass: 7.0629 1.1037 3.1875 5.3880 10.7484 4.3739 5.6683 3.0955 4.6245 3.0228 5.4134 8.5240 1.7001 4.9643 2.5240 1.3828 6.2814 1.3442 1.6831 1.5140 2.0384 3.5002 1.9531 2.0459 1.8922 2.5323 1.4880 1.9377 1.0443 1.1112 6.9035 4.0517 6.6200 1.0365 1.0963 1.1007 1.0926 1.0952 1.0777
irintensity: 5.0907 2.8787 7.4267 0.6040 2.0927 5.3694 0.0293 5.8875 6.8583 24.9058 7.2516 24.1151 26.5351 0.3455 86.2911 9.2493 47.0114 9.2901 9.7874 9.4339 2.8668 18.9917 7.6604 35.5009 2.0731 0.8895 28.8890 2.7669 12.9893 9.4949 22.2136 250.9966 224.5765 14.8139 11.6532 15.3763 6.4202 0.3214 54.5918
temp: 298.150 k
press: 1.00000 atm
elementType: 35 8 7 6 6 6 6 6 6 1 1 1 1 1 1
symmnumber: 1
zpe: 285413.1 jmol-1
zpe.correction: 0.108708 hartree
zpe.thermalcorrener: 0.117278 hartree
zpe.thermalcorrenthalpy: 0.118222 hartree
zpe.thermalcorrgfe: 0.074033 hartree
zpe.sumelectzpe: -375.024455 hartree
zpe.sumelectthermal: -375.015886 hartree
zpe.sumelectthermalent: -375.014942 hartree
zpe.sumelectthermalfe: -375.059131 hartree
dipole: 2.0495 -0.5186 0.0014
dipole: 2.1141
quadrupole: -78.6405 -49.7204 -63.9634
quadrupole: -4.6974 -0.0092 0.0001
quadrupole: -14.5324 14.3877 0.1447 -4.6974 -0.0092 0.0001
hfenergy: -375.1331635 hartree
pointgroup: C01 [X(C6H6Br1N1O1)]
dipole: 0.8184055 -0.1483969 0.0005541 debye
dipolederiv: -0.5554876 -0.0916258 0.0000367 -0.0919376 -0.0751322 0.0000031 0.0001825 0.0000357 -0.0128536 -1.3840216 -0.2362942 0.0005956 -0.3831513 -0.511731 0.0000816 -0.0020221 -0.0005314 -0.3769173 -0.6743623 -0.4851209 -0.0004026 0.3192673 -0.2909395 0.0001761 0.0001918 -0.0000285 -0.2663736 -0.1573093 -0.2698229 0.0001076 -0.6023507 0.0342992 -0.0000875 0.0001098 -0.0000209 -0.0392827 1.7135564 0.2858433 -0.0002651 0.4111542 0.3748216 -0.0000581 0.0014581 0.0006814 0.1720528 0.0095779 0.0784144 -0.0002262 -0.2776634 0.1701795 -0.0000141 0.0001705 0.0001144 -0.0656339 -0.1794267 0.1816486 -0.0000707 0.074275 0.0225102 -0.000016 -0.0000529 0.0000279 0.0470893 0.9166535 0.1174412 -0.0000686 0.4806285 -0.2233315 -0.0000979 -0.0003877 -0.0002139 -0.1742563 -0.0581248 0.5086463 0.0000996 0.0009208 0.269273 0.0001038 0.000038 -0.0000301 -0.0188857 0.0983686 -0.043304 -0.0000081 -0.0390359 -0.0520058 0.0000534 0.0000797 -0.0000058 0.1478918 0.032626 0.0262767 0.0923487 0.0237651 0.0651341 0.0396734 0.0998515 -0.0099316 -0.0205317 0.032675 0.0262039 -0.0923191 0.0235275 0.0651291 -0.0397527 -0.0998596 0.0098575 -0.0203862 0.0457437 -0.1313642 0.000073 -0.0171207 -0.1105161 0.0000907 0.0000613 0.0000993 0.1090851 0.1235745 -0.0141084 0.000064 0.0243221 0.2235833 -0.0000636 0.0000587 -0.0001745 0.3294722 0.0359566 0.047166 0.0000352 0.0533992 0.0387262 -0.0000922 0.0001205 0.0001206 0.1895297 unknown
polarizability: 142.3345821|4.3226161|87.0675327|0.0047607|0.0050968|38.5709466 unknown
InChI: InChI=1S/C6H6BrNO/c1-4-2-5(7)3-8-6(4)9/h2-3,8H,1H3
charge 0 multiplicity 1
15 atoms
Br 3.453572 0.457969 0.000048
O  -2.481274 -0.937302 -0.001056
N  -0.224434 -1.546107 0.000197
C  -0.786837 0.824576 0.000482
C  -1.264473 -0.567963 0.001359
C  0.577482 1.099437 0.000438
C  -1.847214 1.896518 0.000018
C  1.546287 0.041201 0.000385
C  1.132552 -1.27796 0.000027
H  0.921291 2.139266 0.000245
H  -2.504851 1.790249 0.882466
H  -2.504975 1.789416 -0.882238
H  -1.40389 2.906276 -0.000494
H  -0.555517 -2.516569 -0.000327
H  1.819481 -2.126408 -0.000452
