program: Gaussian 09
title: 000285433
version: EM64L-G09RevD.01
frameworkgroup: C1[X(C6H3BrClNO2)]
method: RPBEPBE
basis: SDD
operation: Freq
keyword: #p
keyword: freq=noraman
keyword: PBEPBE/SDD
title: #p freq=noraman PBEPBE/SDD
converged: NO NO NO NO
title: Mulliken charges:
elementType: Br Cl O O N C C C C C C H H H
charge: 0.079763 0.043793 -0.428346 -0.235975 0.081494 0.260165 -0.177221 -0.068538 -0.407885 -0.275800 0.134810 0.302985 0.296363 0.394391
chargesum: 0.00000
title: Mulliken charges with hydrogens summed into heavy atoms:
elementType: Br Cl O O N C C C C C C
charge: 0.079763 0.043793 -0.033955 -0.235975 0.081494 0.260165 0.125764 -0.068538 -0.111522 -0.275800 0.134810
polarizability: 1.66524248e+02 -2.26012452e-01 1.12082151e+02 -2.95801672e-03 -6.96302659e-03 3.67822847e+01
1716.lowfreq: -9.0413 0.0017 0.0017 0.0018 0.4725 8.4390 59.7063 76.4304 125.7957
frequency: 59.6353 76.4266 125.7942 144.2724 161.3507 261.5104 281.1333 297.1667 376.3774 448.8623 487.3000 503.0429 506.3609 609.0863 623.5305 636.3004 709.8979 746.4174 810.8461 945.7160 951.4404 990.3127 1040.7954 1121.6462 1145.0856 1212.7289 1323.7239 1327.2425 1351.1866 1410.1950 1515.9029 1564.1912 1641.7412 3173.3289 3181.9216 3528.7488
redmass: 14.0296 8.3228 14.1355 5.7884 22.4754 11.5151 7.4417 15.9030 10.7722 4.5580 8.6106 3.2604 6.6028 1.3054 7.3467 5.8157 8.9381 4.1726 9.8675 1.4893 1.4142 6.6105 3.3290 5.1634 1.5848 1.9270 4.2025 2.9414 2.6508 3.3189 8.7559 6.2537 9.1543 1.0935 1.0938 1.0643
irintensity: 1.4660 0.1569 0.8979 0.0554 0.1437 0.6581 0.4257 0.3392 2.0623 1.9867 76.6588 24.3157 16.8899 130.8799 2.8115 22.1226 11.5218 35.2032 56.9494 14.5225 11.0279 39.9135 231.1676 207.4450 57.8207 7.3552 30.2605 169.7807 93.6729 62.4870 0.4689 73.4923 275.5990 4.1682 0.5308 63.6503
temp: 298.150 k
press: 1.00000 atm
elementType: 35 17 8 8 7 6 6 6 6 6 6 1 1 1
symmnumber: 1
zpe: 211088.4 jmol-1
zpe.correction: 0.080399 hartree
zpe.thermalcorrener: 0.090392 hartree
zpe.thermalcorrenthalpy: 0.091336 hartree
zpe.thermalcorrgfe: 0.042731 hartree
zpe.sumelectzpe: -908.370681 hartree
zpe.sumelectthermal: -908.360688 hartree
zpe.sumelectthermalent: -908.359744 hartree
zpe.sumelectthermalfe: -908.408350 hartree
dipole: -2.3774 -0.5491 0.0002
dipole: 2.4400
quadrupole: -66.5807 -87.0132 -78.9375
quadrupole: -7.0027 0.0045 0.0005
quadrupole: 10.9297 -9.5027 -1.4270 -7.0027 0.0045 0.0005
hfenergy: -908.4510803 hartree
pointgroup: C01 [X(C6H3Br1Cl1N1O2)]
dipole: -0.9599816 0.0006895 0.0000839 debye
dipolederiv: -0.2502609 0.3257948 0.0000057 0.3860148 -0.4590529 -0.0000195 0.0000004 -0.0000198 0.0275027 -0.8963285 -0.1821927 0.0001474 -0.2185972 -0.091461 0.0000395 0.0002545 0.0000358 -0.0415155 -0.92135 0.5100754 -0.000112 0.6103359 -0.8141304 0.0001732 -0.0006615 0.0007373 -0.422586 -0.9183987 -0.2378824 0.0001437 -0.2274009 -0.8522713 0.00052 -0.0003875 -0.0003989 -0.3227436 -0.8100017 -0.1322011 0.0001034 0.4696426 -0.4552568 -0.0000456 -0.0000547 0.0000852 -0.1658746 -0.7568866 -0.0886846 -0.0000654 -0.0490693 -0.1214764 -0.0000047 0.0002601 0.0000687 0.0433594 0.1246611 0.2718846 -0.0000569 -0.0615912 -0.1004155 -0.0000003 0.0002137 -0.0000661 -0.0269999 0.0496985 -0.8257772 0.000052 -0.966336 0.6559616 0.000067 -0.0000128 0.0000847 -0.0805259 0.3749664 0.0254596 -0.0000847 -0.0020802 0.2664557 -0.0000124 0.0001266 -0.0000103 -0.0258221 1.4610075 0.5281205 -0.0002712 0.2654106 0.2249915 -0.0000595 -0.0003069 -0.0001071 0.0538811 2.0879335 -0.0894913 0.0002111 -0.101677 1.342574 -0.0006698 0.0006598 -0.0003947 0.2499614 0.1359974 -0.0446959 0.0000152 -0.0012153 0.0652701 0.0000143 -0.0000048 0.0000248 0.1564037 0.0662935 0.0381575 0.000019 0.0676263 0.0708645 0.0000011 0.000029 -0.0000357 0.1451965 0.2526685 -0.0985672 -0.0001073 -0.1710631 0.2679469 -0.0000033 -0.000116 -0.000004 0.4097629 unknown
polarizability: 163.6506259|-12.1753603|114.9557728|-0.0044535|-0.0061156|36.7822847 unknown
InChI: InChI=1S/C6H3BrClNO2/c7-4-1-3(6(10)11)2-9-5(4)8/h1-2,10H
charge 0 multiplicity 1
14 atoms
Br 2.563161 -2.276601 0.000059
Cl 3.527881 0.985866 -0.000433
O  -3.178787 0.968246 -0.000576
O  -2.935383 -1.34824 -0.000015
N  0.9148 1.621311 -0.000005
C  -0.95698 0.075241 0.000501
C  -0.054962 -1.019822 0.000419
C  1.329943 -0.77157 0.000164
C  -0.424475 1.388154 0.000241
C  1.764984 0.580892 -0.000026
C  -2.417998 -0.206442 0.000848
H  -0.448975 -2.040194 0.000584
H  -1.079203 2.262899 0.000307
H  -4.145608 0.733258 -0.001371
