program: Gaussian 09
title: 000285482
version: EM64L-G09RevD.01
frameworkgroup: C1[X(C23H24N2O)]
method: RPBEPBE
basis: SDD
operation: Freq
keyword: #p
keyword: freq=noraman
keyword: PBEPBE/SDD
title: #p freq=noraman PBEPBE/SDD
converged: YES YES NO NO
title: Mulliken charges:
elementType: O N N C C C C C C C C C C C C C C C C C C C C C C C H H H H H H H H H H H H H H H H H H H H H H H H
charge: -0.296608 -0.177721 -0.075661 -0.050199 -0.142821 -0.461791 -0.465095 -0.405111 -0.416335 0.498329 0.155232 -0.502248 -0.652771 -0.447440 0.253415 -0.390962 -0.347627 0.352167 -0.378082 -0.396286 0.339011 -0.391342 -0.395418 -0.237104 -0.234838 -0.241015 0.219521 0.231043 0.221349 0.210452 0.279388 0.192281 0.200113 0.204717 0.201071 0.206261 0.250422 0.236503 0.222238 0.279465 0.219603 0.252701 0.240543 0.240419 0.240117 0.238578 0.237528 0.226670 0.226516 0.230826
chargesum: 0.00000
title: Mulliken charges with hydrogens summed into heavy atoms:
elementType: O N N C C C C C C C C C C C C C C C C C C C C C C C
charge: -0.296608 -0.177721 -0.075661 0.169322 0.088222 -0.029989 0.006573 -0.000280 -0.009003 0.498329 0.155232 -0.251827 0.085435 -0.227837 0.253415 -0.138261 -0.107084 0.352167 -0.137663 -0.156170 0.339011 -0.152764 -0.157890 -0.010434 -0.008322 -0.010189
polarizability: 5.82916846e+02 3.65365626e+01 2.52077578e+02 2.75483650e+00 -2.46403518e+01 1.53670906e+02
1716.lowfreq: -8.6443 -3.2066 -0.0001 0.0008 0.0012 5.9944 19.5839 21.5725 27.2767
frequency: 19.5733 21.3969 27.2535 57.0020 69.7135 74.9550 79.8294 100.7250 132.7414 136.8949 162.2872 186.0644 212.3734 229.6403 248.1907 261.7812 276.0206 299.2387 321.5872 338.8996 347.1731 371.1456 390.8307 401.5570 404.5484 410.0118 411.5537 429.9133 453.7919 496.7032 497.4641 516.8028 552.8954 561.7830 605.4957 613.8447 635.9866 654.3336 681.8468 701.1291 709.8194 730.7122 744.3204 767.8799 774.1414 798.2421 826.4018 831.8980 842.4127 848.6140 850.0573 853.0172 888.9061 890.6604 918.1143 920.1930 953.4599 959.5369 965.2187 971.4145 973.7409 987.8598 990.6039 993.4169 994.3759 1012.3283 1024.0302 1039.8618 1055.2054 1064.1337 1084.8701 1105.4688 1110.7968 1118.9709 1122.7545 1124.3977 1135.8640 1172.0154 1173.9129 1190.7871 1199.3674 1203.1509 1218.6672 1228.6076 1232.3524 1243.5148 1278.1899 1280.1007 1290.8318 1301.2569 1311.0661 1314.7577 1319.8444 1333.2981 1340.9490 1343.2901 1347.1554 1355.1668 1362.0668 1373.7695 1376.6718 1385.2604 1415.9983 1421.6557 1438.0664 1463.0395 1465.6623 1470.2223 1472.4923 1482.3445 1482.8615 1491.1427 1506.9706 1549.6175 1551.2988 1567.0763 1585.5635 1611.9103 1613.7961 1622.1072 2890.7335 2937.4752 2943.5556 2964.3111 2968.5334 2971.1482 2975.3493 2978.9224 3033.8910 3040.4986 3053.4666 3058.2738 3080.2113 3111.2178 3123.1518 3124.9906 3128.3838 3136.4845 3141.2605 3143.2460 3147.6146 3150.1395 3163.5493 3165.8770
redmass: 4.5172 4.4965 4.3375 4.8287 3.8504 4.7424 2.9580 5.1124 5.3398 5.8114 2.5662 1.4785 3.1521 2.5700 4.9795 3.3741 3.0510 2.2494 4.1287 3.4803 3.4420 3.8769 4.2961 4.7199 2.9531 3.6737 3.3344 4.7922 2.9777 2.5051 3.5545 2.9498 2.6098 5.6243 3.8369 6.3034 6.7853 5.0348 4.0658 1.7433 5.0996 3.6077 4.1546 2.4912 2.2552 2.1803 1.6058 2.3012 1.8677 1.5449 1.5867 2.2339 1.5845 1.5345 1.9095 1.5258 1.3795 2.3181 1.5483 1.4591 1.4345 4.4902 3.1457 3.8833 1.3164 2.8441 2.3901 1.9074 1.4164 1.5890 1.6286 1.7205 2.0209 1.3606 2.0171 1.8934 2.8881 1.8954 1.0539 1.2442 1.3060 1.4766 2.4897 1.7409 1.4588 1.5178 1.2527 1.2559 2.8814 1.3417 1.5568 1.5290 1.2629 1.5461 1.7372 1.4996 1.7881 1.5349 2.9109 2.8095 2.3492 2.5384 1.2501 4.0770 2.4002 1.0886 1.0881 1.0916 2.1469 1.1061 1.0937 1.0541 2.8462 6.9252 6.7055 5.7486 6.1992 6.0930 7.4036 6.4407 1.0810 1.0806 1.0856 1.0415 1.0674 1.0633 1.0645 1.0624 1.0958 1.1000 1.1008 1.0932 1.0950 1.0992 1.0850 1.0864 1.0872 1.0882 1.0919 1.0913 1.0959 1.0961 1.0968 1.1013
irintensity: 0.5907 0.7760 0.2406 0.6112 0.1830 1.8704 1.1840 2.3031 1.0220 0.4688 4.3784 1.2927 4.0448 8.4293 4.6786 4.8387 4.6683 2.6156 1.1498 1.7133 4.5407 17.3640 4.0885 4.0062 4.9284 0.2374 10.1797 1.9653 3.3441 0.9661 5.6648 2.8324 7.6042 2.8212 11.4469 0.5473 0.2628 7.7559 1.2804 46.8679 6.2282 9.6073 18.4175 27.1734 41.8691 1.0007 13.4886 2.5341 2.8644 31.1874 8.6264 10.4652 8.1081 22.1731 19.9377 3.9985 1.0491 0.5413 14.4694 4.9420 0.4925 3.0233 15.4804 4.6478 0.0653 0.6640 17.8265 4.8562 2.1868 3.1370 9.0530 7.5707 5.8410 9.6492 3.8649 5.9581 38.7241 0.1059 0.0156 0.2308 20.9301 17.6044 26.5764 1.4130 1.6128 5.2497 3.0394 7.6161 0.1991 3.4249 1.9052 24.2363 8.9532 78.9457 10.0467 0.6943 11.5244 36.2017 26.5450 6.8241 14.1987 89.2155 96.2156 7.6933 4.6519 4.3823 12.1385 13.3265 72.0995 7.1706 8.3708 11.2301 5.9810 65.0000 79.0917 46.1643 2.2373 3.5732 126.7379 10.1003 31.7765 10.6437 53.9109 84.2000 15.8123 30.8535 42.7955 38.5388 61.9483 55.9888 53.8766 38.3004 10.2827 2.0658 19.5613 2.8292 4.6823 18.0485 8.6246 10.3683 5.2150 45.8957 8.1356 37.5627
temp: 298.150 k
press: 1.00000 atm
elementType: 8 7 7 6 6 6 6 6 6 6 6 6 6 6 6 6 6 6 6 6 6 6 6 6 6 6 1 1 1 1 1 1 1 1 1 1 1 1 1 1 1 1 1 1 1 1 1 1 1 1
symmnumber: 1
zpe: 1083809.7 jmol-1
zpe.correction: 0.412801 hartree
zpe.thermalcorrener: 0.435300 hartree
zpe.thermalcorrenthalpy: 0.436244 hartree
zpe.thermalcorrgfe: 0.359266 hartree
zpe.sumelectzpe: -1073.717498 hartree
zpe.sumelectthermal: -1073.694999 hartree
zpe.sumelectthermalent: -1073.694055 hartree
zpe.sumelectthermalfe: -1073.771033 hartree
dipole: 1.4628 3.6773 1.0506
dipole: 4.0946
quadrupole: -135.2145 -161.1620 -154.1861
quadrupole: -24.5752 -2.8349 -8.9597
quadrupole: 14.9730 -10.9745 -3.9985 -24.5752 -2.8349 -8.9597
hfenergy: -1074.1302989 hartree
pointgroup: C01 [X(C23H24N2O1)]
dipole: 0.5849385 1.4995899 -0.0650925 debye
polarizability: 582.9876902|32.3210404|227.6226551|-15.6937586|-49.3813213|178.0549841 unknown
InChI: InChI=1S/C23H24N2O/c1-25-22-10-6-5-9-21(22)19(15-23(25)26)16-24-20-13-11-18(12-14-20)17-7-3-2-4-8-17/h2-4,7-8,11-16,21-22H,5-6,9-10H2,1H3
charge 0 multiplicity 1
50 atoms
O  -5.281922 -3.151391 0.822483
N  -5.500872 -0.887556 0.223408
N  -0.385932 0.129344 -0.165585
C  -4.901099 0.477222 0.33705
C  -3.423066 0.508881 -0.156125
C  -5.725411 1.548496 -0.414727
C  -2.833707 1.913521 0.160667
C  -5.138838 2.959618 -0.172059
C  -3.642134 3.023144 -0.546174
C  -2.634256 -0.662833 0.425867
C  -4.767708 -1.992841 0.655959
C  -3.313217 -1.779654 0.8536
C  -6.957564 -1.050156 0.074098
C  -1.167271 -0.72916 0.452604
C  1.027862 0.032614 -0.084153
C  1.781187 0.523945 -1.185551
C  1.732911 -0.461369 1.053311
C  3.899338 -0.022229 -0.046604
C  3.185592 0.481845 -1.171592
C  3.138668 -0.481917 1.066107
C  5.388495 -0.048832 -0.025813
C  6.092594 -1.068969 0.673618
C  6.149505 0.943831 -0.704812
C  7.502902 -1.096025 0.694069
C  7.559934 0.917553 -0.686172
C  8.245321 -0.102633 0.013878
H  -4.889406 0.756201 1.418728
H  -3.421009 0.388287 -1.262933
H  -6.779077 1.530824 -0.082314
H  -5.717605 1.317394 -1.499397
H  -1.778725 1.935323 -0.154048
H  -2.854056 2.07604 1.25855
H  -5.259392 3.22234 0.899139
H  -5.717197 3.704915 -0.75077
H  -3.532367 2.908342 -1.644275
H  -3.225477 4.014735 -0.285724
H  -2.785086 -2.65206 1.256251
H  -7.306477 -0.639283 -0.88831
H  -7.510908 -0.553662 0.896403
H  -7.170103 -2.130105 0.111337
H  -0.757403 -1.615391 0.983813
H  1.236475 0.915505 -2.050481
H  1.179732 -0.78198 1.943804
H  3.738728 0.824295 -2.052926
H  3.658246 -0.821315 1.969182
H  5.53161 -1.864602 1.176959
H  5.633234 1.75962 -1.223265
H  8.022904 -1.89703 1.231445
H  8.124377 1.698077 -1.208668
H  9.340571 -0.123221 0.029047
