program: Gaussian 09
title: 000285444
version: EM64L-G09RevD.01
frameworkgroup: C1[X(C13H16O4)]
method: RPBEPBE
basis: SDD
operation: Freq
keyword: #pfreq=noraman
keyword: PBEPBE/SDD
title: #p freq=noraman PBEPBE/SDD
converged: YES YES NO NO
title: Mulliken charges:
elementType: O O O O C C C C C C C C C C C C C H H H H H H H H H H H H H H H H
charge: -0.276620 -0.254317 -0.260420 -0.277789 0.166066 -0.456951 -0.011310 0.326621 -0.317060 -0.340089 -0.324337 -0.299174 -0.390592 -0.348119 -0.221842 -0.239991 -0.236019 0.244845 0.246145 0.252628 0.214529 0.226880 0.232785 0.222186 0.232347 0.214588 0.225611 0.211525 0.267228 0.288743 0.226129 0.227821 0.227956
chargesum: 0.00000
title: Mulliken charges with hydrogens summed into heavy atoms:
elementType: O O O O C C C C C C C C C C C C C
charge: -0.276620 -0.254317 -0.260420 -0.277789 0.166066 0.034038 0.241318 0.326621 0.124349 0.114881 0.122598 0.137962 -0.123364 -0.059375 0.004288 -0.012171 -0.008064
polarizability: 1.55813591e+02 1.46901586e+01 1.45602774e+02 1.14475584e+01 -6.21669933e+00 1.27964053e+02
1716.lowfreq: -13.6100 -11.0784 -5.6059 -0.0007 0.0001 0.0007 21.1675 34.1389 41.6425
frequency: 19.3184 33.7422 41.4259 56.9482 72.8306 80.7687 120.9798 189.3095 201.0219 219.7565 262.9005 281.1189 303.3595 339.8312 404.6934 437.8593 479.4110 500.0003 599.1093 613.1885 613.4783 670.3349 683.0428 688.6329 711.4871 723.8930 758.6211 786.2019 810.6196 830.8554 856.5062 866.0412 868.7283 906.1563 923.5394 938.1182 950.0593 961.2984 974.1795 982.0890 987.2436 990.7636 991.9012 1001.2047 1025.6776 1061.9745 1082.6350 1099.8664 1108.4225 1111.5523 1139.8442 1156.5222 1170.8962 1176.4696 1183.6945 1192.5477 1193.1027 1206.5171 1246.7162 1262.0604 1302.6390 1311.2728 1311.6807 1319.4331 1323.1604 1334.1332 1366.2158 1379.2142 1427.4596 1432.9423 1471.6971 1474.7159 1476.0303 1476.6761 1486.0712 1589.6613 1609.5606 2990.3699 2995.4824 2995.5528 3008.6419 3023.0253 3043.5528 3075.9854 3087.3844 3092.3417 3103.5484 3106.9306 3122.6378 3133.2499 3147.3425 3155.9439 3165.4229
redmass: 3.4274 2.9660 4.4984 2.8598 3.8072 4.1584 3.4045 4.4081 3.2981 3.4026 4.5548 4.0934 3.6275 6.2526 2.8828 4.7581 2.9636 3.6907 5.0644 2.3653 6.3043 5.8406 5.2864 5.2439 1.7880 6.4585 2.4368 2.4407 3.7980 1.2697 2.2821 1.5307 2.9306 4.7450 2.9771 1.4389 3.7518 5.8706 3.0208 5.2131 2.2810 2.3200 4.0774 1.3344 2.3473 2.5718 1.6273 2.7453 1.6268 2.0704 2.4875 1.1460 1.0543 1.2091 1.1386 1.1534 1.2654 1.7420 1.4107 1.8111 1.3152 1.3045 1.2724 1.2694 1.2446 1.3757 1.3579 8.7454 1.0849 2.1914 1.0899 1.1214 1.9331 1.1399 1.1006 6.2885 6.0013 1.0695 1.0622 1.0610 1.0631 1.0602 1.0885 1.1034 1.1011 1.1015 1.1041 1.1020 1.0848 1.0885 1.0927 1.0956 1.1009
irintensity: 5.5253 1.5450 0.7209 3.0713 0.2300 3.8480 1.0177 0.3076 9.2016 3.9727 6.5776 0.6438 0.6192 10.9599 0.2582 6.5635 16.3643 1.1941 26.8758 3.1708 0.3026 0.4654 7.6873 16.0947 78.4935 1.9149 36.1382 37.5275 23.0284 1.4601 5.0728 2.9420 8.3578 28.7575 66.2813 7.9268 29.1090 15.2397 10.3557 23.0389 0.8833 22.5652 91.8817 0.5316 23.6541 72.2978 1.8372 47.4037 0.5475 53.0219 62.2693 0.3370 0.0652 4.6715 3.8483 1.9093 13.8636 7.2927 10.2299 45.9317 15.9108 3.6482 0.9546 2.2509 3.1349 3.1866 37.5071 0.1540 13.3163 12.4893 5.2283 6.2820 5.2623 4.2382 3.8049 0.2048 0.2459 56.1277 28.7633 71.5287 84.2250 4.3354 33.0422 12.6863 30.2173 15.9204 55.2108 31.8298 0.0222 12.4078 16.6944 14.9097 20.4759
temp: 298.150 k
press: 1.00000 atm
elementType: 8 8 8 8 6 6 6 6 6 6 6 6 6 6 6 6 6 1 1 1 1 1 1 1 1 1 1 1 1 1 1 1 1
symmnumber: 1
zpe: 702752.5 jmol-1
zpe.correction: 0.267664 hartree
zpe.thermalcorrener: 0.283082 hartree
zpe.thermalcorrenthalpy: 0.284026 hartree
zpe.thermalcorrgfe: 0.222268 hartree
zpe.sumelectzpe: -804.541198 hartree
zpe.sumelectthermal: -804.525781 hartree
zpe.sumelectthermalent: -804.524836 hartree
zpe.sumelectthermalfe: -804.586595 hartree
dipole: -0.4645 0.6640 1.5325
dipole: 1.7336
quadrupole: -82.6423 -92.7319 -102.9532
quadrupole: -0.1691 4.2565 1.1866
quadrupole: 10.1335 0.0439 -10.1774 -0.1691 4.2565 1.1866
hfenergy: -804.8088626 hartree
pointgroup: C01 [X(C13H16O4)]
dipole: 0.0921463 -0.3996594 0.5449522 debye
polarizability: 163.0777616|11.0530561|135.298866|-6.762494|10.6276973|131.0037906 unknown
InChI: InChI=1S/C13H16O4/c1-2-4-11(5-3-1)13(16-8-9-17-13)10-12-14-6-7-15-12/h1-5,12H,6-10H2
charge 0 multiplicity 1
33 atoms
O  0.289567 -1.982839 -1.460625
O  -0.507819 -1.77408 0.715449
O  -2.126484 0.936436 1.073195
O  -2.850648 1.64631 -1.072713
C  -0.089321 -0.967983 -0.444758
C  -1.311446 -0.231938 -1.011441
C  -1.693379 1.085879 -0.32599
C  1.114916 -0.080466 -0.093651
C  0.899321 -3.1084 -0.710701
C  0.472131 -2.882594 0.77458
C  -3.60288 0.85188 1.029752
C  -3.948115 1.844751 -0.095664
C  2.123462 0.171233 -1.054953
C  1.206041 0.513457 1.190668
C  3.217089 1.007876 -0.734956
C  2.301216 1.346781 1.508676
C  3.309301 1.596727 0.54757
H  -2.16588 -0.929638 -0.988774
H  -1.095635 0.002425 -2.070005
H  -0.865081 1.81532 -0.309557
H  1.999375 -3.088158 -0.822624
H  0.493163 -4.034831 -1.148129
H  -0.051626 -3.740157 1.223853
H  1.337645 -2.594948 1.400912
H  -3.971579 1.146035 2.024068
H  -3.931563 -0.177874 0.787884
H  -4.894999 1.625925 -0.615628
H  -3.943596 2.889024 0.272111
H  2.046523 -0.300831 -2.040379
H  0.413441 0.318842 1.921123
H  3.995612 1.197955 -1.482652
H  2.366866 1.802293 2.503267
H  4.158084 2.244185 0.795788
