program: Gaussian 09
title: 000285401
version: EM64L-G09RevD.01
frameworkgroup: C1[X(C15H14FN3O4)]
method: RPBEPBE
basis: SDD
operation: Freq
keyword: #p
keyword: freq=noraman
keyword: PBEPBE/SDD
title: #p freq=noraman PBEPBE/SDD
converged: YES YES NO NO
title: Mulliken charges:
elementType: F O O O O N N N C C C C C C C C C C C C C C C H H H H H H H H H H H H H H
charge: -0.152600 -0.463393 -0.284036 -0.216334 -0.173071 -0.495677 -0.515463 0.020720 0.483076 -0.542639 0.474440 -0.428664 -0.378441 -0.453508 -0.332804 -0.307041 0.546341 0.277466 -0.601446 0.282752 -0.308858 0.201622 -0.313357 0.236052 0.199344 0.231424 0.282754 0.212935 0.300280 0.198182 0.202910 0.291501 0.301543 0.284302 0.324270 0.266515 0.348902
chargesum: 0.00000
title: Mulliken charges with hydrogens summed into heavy atoms:
elementType: F O O O O N N N C C C C C C C C C C C C C C C
charge: -0.152600 -0.114491 -0.284036 -0.216334 -0.173071 -0.204176 -0.213920 0.020720 0.483076 -0.107242 0.474440 -0.197240 -0.095687 -0.240573 -0.032524 0.094051 0.546341 0.277466 -0.317144 0.282752 0.015412 0.201622 -0.046842
polarizability: 3.85150095e+02 -4.67598966e+00 2.08942302e+02 -4.01687458e+00 -6.58993842e+00 9.03947769e+01
1716.lowfreq: -6.0578 -0.0012 -0.0009 0.0006 0.7328 4.4589 11.1688 19.6973 23.9059
frequency: 11.0261 19.6953 23.8906 30.7844 45.1095 58.8480 68.5889 95.8404 118.7002 126.2156 147.7134 179.0772 181.3371 213.9635 233.0232 252.9176 274.2837 303.2698 344.6057 355.8189 363.1109 376.4328 392.4406 409.0544 426.0396 435.3702 454.8349 487.8969 529.8410 549.4857 557.8862 584.9121 617.5034 632.9539 656.4529 679.2379 696.1287 716.5414 717.3850 738.1146 753.8289 774.4951 783.5126 818.9373 841.1733 844.0373 852.0022 868.5613 904.0006 911.2977 939.8018 952.5193 986.0278 994.9867 999.9056 1008.2095 1020.7257 1045.6793 1057.2873 1122.4692 1140.2344 1164.6281 1176.7203 1193.9030 1196.1589 1197.9738 1208.7002 1222.5837 1245.7399 1256.5826 1258.8055 1299.0526 1316.9046 1340.3128 1347.0282 1377.3563 1381.7337 1398.1561 1413.0964 1424.2078 1452.2415 1474.4282 1493.7652 1501.4228 1506.3729 1518.3758 1587.7992 1596.8406 1626.4852 1626.8239 1654.3490 2941.8882 2984.0437 3004.0310 3045.4557 3100.3587 3132.8013 3152.4661 3164.4354 3172.1363 3199.5473 3200.6437 3517.5937 3532.0398 3575.6648
redmass: 6.2660 10.3631 7.1115 4.0147 7.0552 5.0236 7.6288 6.6431 3.6915 4.3238 6.1596 6.1095 5.6261 2.3764 3.8902 1.5886 5.9497 9.0254 3.1882 5.7090 3.9099 7.4394 6.9478 2.9564 3.6640 2.4216 2.7787 2.7240 5.6018 3.2658 3.6417 3.9796 1.2168 6.6209 7.9755 4.0800 11.1379 6.5084 4.8370 3.6946 8.2419 5.3202 6.7564 1.4480 2.8549 1.4041 5.4192 1.3749 1.5427 5.7062 1.3834 2.0451 1.3139 1.3318 3.1905 3.8077 3.3833 1.8993 3.3164 1.3783 1.3550 1.1313 2.6944 2.8868 1.1360 1.3468 4.7515 1.5429 1.6335 1.8622 1.3409 2.5274 1.4359 1.8748 3.5395 4.7960 7.2502 1.3664 3.3518 6.4365 1.1078 1.0899 2.8846 2.3631 2.1038 2.8493 6.0282 4.9952 6.8224 6.3081 3.9441 1.0556 1.0701 1.0973 1.1006 1.0880 1.0957 1.0914 1.0909 1.0910 1.0945 1.0957 1.0766 1.0759 1.0665
irintensity: 1.0205 0.0850 0.2713 1.7408 0.4416 2.2666 13.8888 1.8602 8.7557 2.3481 14.1408 0.6467 1.8641 44.3283 16.0776 96.3953 10.2574 11.5419 3.4737 3.6107 3.4460 1.0581 0.3661 0.0385 0.2864 9.4526 9.4319 12.9049 13.3908 41.5027 12.3630 14.9074 121.2195 2.0877 8.1942 0.9127 21.1881 10.4356 9.0722 9.5348 10.3935 11.7778 7.0692 46.1155 13.8157 41.5205 9.7785 44.7080 47.9548 16.0808 1.2081 2.9490 1.3208 1.6792 36.6574 12.1298 12.5630 17.5950 24.7968 10.5883 18.8617 21.1248 384.6784 109.4392 38.7990 27.2851 220.6813 1.0534 23.8793 152.1904 42.9092 82.6815 5.2185 13.6097 183.8685 164.7005 64.6083 1.9848 61.6371 2.1430 17.3963 7.5249 538.5459 574.4202 676.1329 15.8915 11.7215 61.8597 48.9603 4.4533 141.3832 92.6045 8.7242 113.9137 22.3873 24.3980 23.6986 12.9070 0.5295 1.1173 5.0021 16.6647 9.4561 18.4102 3.7348
temp: 298.150 k
press: 1.00000 atm
elementType: 9 8 8 8 8 7 7 7 6 6 6 6 6 6 6 6 6 6 6 6 6 6 6 1 1 1 1 1 1 1 1 1 1 1 1 1 1
symmnumber: 1
zpe: 717207.2 jmol-1
zpe.correction: 0.273170 hartree
zpe.thermalcorrener: 0.294561 hartree
zpe.thermalcorrenthalpy: 0.295505 hartree
zpe.thermalcorrgfe: 0.218279 hartree
zpe.sumelectzpe: -1143.255123 hartree
zpe.sumelectthermal: -1143.233732 hartree
zpe.sumelectthermalent: -1143.232787 hartree
zpe.sumelectthermalfe: -1143.310013 hartree
dipole: 8.0744 -2.0760 1.5146
dipole: 8.4734
quadrupole: -160.7449 -123.9228 -133.2192
quadrupole: -13.4208 14.1540 2.9544
quadrupole: -21.4493 15.3728 6.0764 -13.4208 14.1540 2.9544
hfenergy: -1143.5282923 hartree
pointgroup: C01 [X(C15H14F1N3O4)]
dipole: -3.1834183 -0.8393952 -0.5242344 debye
polarizability: 385.2605429|2.335493|208.9540921|-3.0285663|-5.7301253|90.2725388 unknown
InChI: InChI=1S/C15H14FN3O4/c16-13-6-5-12(9-14(13)19(22)23)18-15(21)17-11-3-1-10(2-4-11)7-8-20/h1-6,9,17-18,20H,7-8H2
charge 0 multiplicity 1
37 atoms
F  6.174262 1.848564 -0.139595
O  -7.249316 1.878298 -0.759413
O  -0.355428 1.252282 0.094409
O  5.687592 -2.396024 -0.01773
O  7.140874 -0.642279 -0.095478
N  -1.211242 -0.94504 0.159849
N  1.096207 -0.607858 0.082758
N  5.950235 -1.127345 -0.052873
C  -5.4611 -0.407091 0.31874
C  -6.973851 -0.252006 0.376071
C  -2.619279 -0.706394 0.208752
C  -4.863717 -1.692802 0.293548
C  -4.601185 0.72217 0.289236
C  -3.463863 -1.846483 0.239062
C  -3.198802 0.589387 0.233357
C  -7.59241 0.446202 -0.849164
C  2.351002 0.045339 0.027106
C  -0.183054 -0.000612 0.111467
C  3.507644 -0.768052 0.012929
C  4.797251 -0.195969 -0.042106
C  2.500619 1.463519 -0.015637
C  4.934999 1.213996 -0.084149
C  3.787471 2.026179 -0.070637
H  -7.273152 0.335937 1.265793
H  -7.44617 -1.248051 0.475612
H  -5.497912 -2.587368 0.31955
H  -5.04908 1.720209 0.298351
H  -3.028921 -2.85518 0.222913
H  -2.55254 1.467992 0.209924
H  -8.695655 0.316808 -0.826654
H  -7.196773 0.000279 -1.785999
H  -0.953846 -1.93465 0.15985
H  1.143997 -1.628514 0.109147
H  3.450586 -1.861262 0.043486
H  1.610539 2.0940 -0.003983
H  3.917711 3.111822 -0.103554
H  -7.539896 2.342997 -1.583338
