program: Gaussian 09
title: 000285381
version: EM64L-G09RevD.01
frameworkgroup: C1[X(C9H11F)]
method: RPBEPBE
basis: SDD
operation: Freq
keyword: #pfreq=noraman
keyword: PBEPBE/SDD
title: #p freq=noraman PBEPBE/SDD
converged: YES YES NO NO
title: Mulliken charges:
elementType: F C C C C C C C C C H H H H H H H H H H H
charge: -0.246261 0.485357 -0.579731 -0.500475 0.446692 -0.439959 -0.193122 -0.430857 -0.207387 -0.810612 0.236438 0.205481 0.254981 0.228763 0.200758 0.211199 0.231044 0.222639 0.229946 0.220795 0.234312
chargesum: 0.00000
title: Mulliken charges with hydrogens summed into heavy atoms:
elementType: F C C C C C C C C C
charge: -0.246261 0.485357 -0.137813 -0.245494 0.446692 -0.211196 0.218836 -0.199813 0.015252 -0.125560
polarizability: 1.16217540e+02 5.54046382e+00 1.05057563e+02 9.20358248e+00 -5.70248127e+00 5.78650312e+01
1716.lowfreq: -28.6168 -5.2161 -0.0006 -0.0004 -0.0003 2.6214 6.8561 34.3688 88.7415
frequency: -28.2445 33.7058 88.6904 138.1177 210.6483 241.2110 281.5562 375.6256 415.2253 448.9985 503.4109 522.4042 597.8546 705.9014 715.1340 792.0454 822.4622 873.2601 899.9499 913.6590 960.2886 979.0097 984.9435 994.5855 1013.2556 1049.4387 1068.8067 1101.5255 1158.9640 1174.6231 1187.2616 1220.8517 1260.5843 1314.7719 1340.5092 1371.1847 1380.2307 1397.9705 1431.9179 1448.0468 1464.9244 1469.9568 1473.4034 1487.2089 1600.3859 1618.2914 2977.4593 2987.5012 3008.2221 3044.6643 3056.3954 3083.7623 3084.9934 3113.8296 3125.3383 3130.8011 3150.9882
redmass: 1.0269 4.4073 6.6051 2.7053 2.9579 4.3357 2.4601 3.0888 2.2003 2.6992 4.3953 4.6847 3.1853 3.1374 2.5605 1.4748 3.0288 2.9561 1.3102 1.3769 2.2068 1.3549 2.8738 3.1602 1.7101 1.5732 2.2453 1.6359 1.3353 1.2328 1.1463 1.1835 2.6699 1.2585 1.5862 1.4021 3.8953 1.2633 2.4475 1.1031 1.0999 1.0463 1.5265 1.6474 5.7844 6.2220 1.0371 1.0598 1.0582 1.0994 1.0976 1.0989 1.1110 1.0860 1.0915 1.0918 1.0993
irintensity: 0.4276 2.1690 4.0526 7.6880 1.0336 1.6960 0.3632 2.6968 1.3490 14.1326 1.0005 0.1554 2.8214 13.9148 18.9832 38.7721 16.8959 2.7728 0.8404 3.6551 26.1776 0.1730 8.3223 3.6697 0.4803 11.1528 18.7783 11.5485 0.6892 2.3978 0.2328 8.6998 0.6703 1.4120 5.9203 4.2357 2.2032 11.3886 3.0144 13.6939 3.7291 12.7317 10.1089 23.5694 6.9354 20.9382 33.8330 19.7726 62.5367 21.1267 20.7883 19.9008 47.6641 1.8878 28.8765 11.1213 26.6433
temp: 298.150 k
press: 1.00000 atm
elementType: 9 6 6 6 6 6 6 6 6 6 1 1 1 1 1 1 1 1 1 1 1
symmnumber: 1
zpe: 456355.9 jmol-1
zpe.correction: 0.173817 hartree
zpe.thermalcorrener: 0.182893 hartree
zpe.thermalcorrenthalpy: 0.183837 hartree
zpe.thermalcorrgfe: 0.138634 hartree
zpe.sumelectzpe: -448.655679 hartree
zpe.sumelectthermal: -448.646603 hartree
zpe.sumelectthermalent: -448.645659 hartree
zpe.sumelectthermalfe: -448.690862 hartree
dipole: 0.1515 1.6683 0.2912
dipole: 1.7003
quadrupole: -52.8608 -57.5129 -61.4997
quadrupole: 7.2728 2.3937 -2.4478
quadrupole: 4.4303 -0.2217 -4.2086 7.2728 2.3937 -2.4478
hfenergy: -448.8294959 hartree
pointgroup: C01 [X(C9H11F1)]
dipole: -0.0896231 -0.6467665 0.1453941 debye
dipolederiv: -0.362965 -0.0038342 -0.01477 0.0753705 -0.6852924 0.128205 -0.0582358 0.0742703 -0.3202439 0.284728 -0.0344641 -0.0561862 -0.0285162 0.0113585 0.0266109 -0.0756192 0.0429257 -0.0561443 -0.0230143 0.0697315 -0.0688316 0.0976495 0.0571934 0.0115582 -0.1608194 0.086041 0.0050104 -0.1943811 -0.1586583 -0.0254769 -0.1206046 -0.0252298 0.0411966 0.016617 0.0335216 -0.1669286 0.0989416 0.1810896 -0.0042286 0.2147421 0.3069453 -0.0061259 -0.0115465 -0.0125644 -0.0167874 -0.1641674 0.0530777 -0.0196763 0.0881595 -0.0065198 0.0030003 -0.0033861 0.0073578 -0.1873905 0.425096 -0.002554 0.0252472 -0.0772361 0.7162091 -0.0685779 0.1296817 -0.0943979 0.4135184 0.0237721 -0.0115136 -0.0636908 -0.0979638 -0.1976084 0.0242642 -0.0703456 0.0048884 -0.1705419 0.0299629 -0.0332055 -0.0500126 -0.0328816 0.1110726 0.0360329 -0.0478876 0.0370898 -0.113407 0.0518694 -0.0514381 -0.0058811 -0.1219357 -0.1292864 0.0099736 -0.0069184 -0.002983 0.0647102 -0.00603 0.0202492 0.0098313 0.0439818 0.0385468 -0.119557 0.0561276 -0.0681654 -0.0589264 0.00973 -0.0219175 0.0092304 -0.1171838 -0.1112103 0.067927 0.0053328 0.0235049 0.0904008 0.0840034 0.0593865 0.0344012 0.0612309 -0.0404829 -0.0419691 0.0301434 -0.0343034 0.1253324 0.0065539 -0.1243083 0.0279779 -0.1033014 -0.0528275 -0.0017664 0.0307326 0.0069592 0.1435911 -0.2476171 -0.0299695 0.0279788 0.034391 0.0073843 0.0106387 0.0374536 0.0256326 0.0684599 0.1001353 0.0208438 0.0554034 -0.0132102 -0.0236326 -0.0538856 0.0013133 -0.0669187 -0.1122737 -0.1240344 0.0049234 0.0704366 -0.0160783 0.0874889 -0.0056617 0.0713482 -0.010377 0.137006 0.0408193 0.07921 0.0367173 0.0817095 -0.0958477 -0.0507549 0.0398204 -0.0513519 0.1383142 0.0697447 -0.0353334 0.0304447 -0.0503696 0.0086291 -0.0815833 -0.0259063 -0.1264187 -0.0812542 -0.1435072 -0.0188101 0.0557644 0.0868664 0.0652114 -0.026481 0.0709346 -0.0015971 0.0902364 0.0403599 0.0374949 -0.0746793 -0.0048199 -0.0421017 0.0969553 -0.0288404 0.1268861 0.007318 unknown
polarizability: 116.2307496|4.6497207|104.9642621|-10.6771959|3.9903852|57.9451222 unknown
InChI: InChI=1S/C9H11F/c1-8-3-2-4-9(7-8)5-6-10/h2-4,7H,5-6H2,1H3
charge 0 multiplicity 1
21 atoms
F  -2.631038 1.634325 -0.415856
C  -0.528244 -0.477896 0.434041
C  -2.00334 -0.401848 0.803493
C  0.267704 0.693211 0.384781
C  1.637777 0.645352 0.021033
C  0.068781 -1.724692 0.115164
C  -2.895189 0.192637 -0.294252
C  2.211964 -0.612417 -0.293687
C  1.432145 -1.790283 -0.246998
C  2.465644 1.918678 -0.028998
H  -2.149144 0.204409 1.718115
H  -2.387432 -1.416769 1.027625
H  -0.191598 1.660006 0.623829
H  -0.531425 -2.642411 0.155585
H  -3.967286 0.099831 -0.039802
H  -2.688847 -0.24994 -1.285188
H  3.270896 -0.668457 -0.57378
H  1.888223 -2.757269 -0.488502
H  2.471276 2.433131 0.950284
H  3.513218 1.710167 -0.306671
H  2.056314 2.633635 -0.767318
