program: Gaussian 09
title: 000285373
version: EM64L-G09RevD.01
frameworkgroup: C1[X(C8H7F3)]
method: RPBEPBE
basis: SDD
operation: Freq
keyword: #p
keyword: freq=noraman
keyword: PBEPBE/SDD
title: #p freq=noraman PBEPBE/SDD
converged: NO YES NO NO
title: Mulliken charges:
elementType: F F F C C C C C C C C H H H H H H H
charge: -0.162278 -0.171767 -0.162270 -0.667196 0.449637 0.428537 -0.364882 -0.364813 -0.219871 -0.219883 -0.232337 0.258693 0.258682 0.238153 0.238169 0.230433 0.230436 0.232556
chargesum: 0.00000
title: Mulliken charges with hydrogens summed into heavy atoms:
elementType: F F F C C C C C C C C
charge: -0.162278 -0.171767 -0.162270 -0.149820 0.449637 0.428537 -0.126729 -0.126645 0.010562 0.010553 0.000219
polarizability: 1.03146890e+02 2.21467201e-03 8.82283145e+01 -1.61938996e+01 5.27735390e-04 5.09554075e+01
1716.lowfreq: -18.3278 -9.3058 -5.4222 -0.0004 -0.0001 0.0011 19.8799 58.8640 82.6240
frequency: 13.5660 58.8601 82.6200 219.8167 267.2426 284.9033 364.3944 400.9879 445.9024 465.9874 470.9800 554.7580 616.3628 617.1272 700.4031 732.9843 786.5325 821.5358 851.4206 876.6895 922.0434 976.4749 990.7750 998.7027 1009.0951 1023.0419 1026.9921 1091.8146 1175.1293 1190.5185 1199.5348 1216.3040 1244.4949 1329.7793 1338.0004 1386.3963 1443.2248 1450.5616 1486.0851 1597.9413 1617.0672 3028.8281 3090.3147 3125.2132 3127.3394 3139.4966 3151.6638 3167.6106
redmass: 5.1268 6.9024 7.1232 5.6325 7.4075 10.5731 2.1460 2.7909 8.1092 6.8368 4.7606 6.3929 5.8940 6.2631 1.9912 2.5098 2.8554 4.2354 1.2561 2.6503 1.4489 1.3964 5.9908 1.3405 2.1446 7.6195 2.2128 1.5411 1.0529 1.1281 7.5756 2.4349 1.4687 1.2595 1.6005 7.9365 2.1729 1.0932 2.3361 6.1150 6.1697 1.0600 1.1022 1.0854 1.0884 1.0921 1.0965 1.1017
irintensity: 0.2772 0.3693 1.3926 1.5590 0.0163 1.3986 0.9620 0.0043 0.6947 1.2623 4.3392 30.7337 20.8116 0.0283 40.0895 71.5507 1.4517 10.5306 1.3309 53.2350 7.8143 0.6152 2.1195 2.0465 75.7236 231.9609 4.0645 31.8982 0.1829 2.7363 184.6090 12.9136 50.6090 1.8259 36.6011 0.0003 10.9753 17.9260 14.0187 0.8441 1.4363 11.4273 2.7532 4.3551 1.1137 14.7196 35.2966 15.3591
temp: 298.150 k
press: 1.00000 atm
elementType: 9 9 9 6 6 6 6 6 6 6 6 1 1 1 1 1 1 1
symmnumber: 1
zpe: 341997.5 jmol-1
zpe.correction: 0.130260 hartree
zpe.thermalcorrener: 0.139848 hartree
zpe.thermalcorrenthalpy: 0.140793 hartree
zpe.thermalcorrgfe: 0.093132 hartree
zpe.sumelectzpe: -607.782869 hartree
zpe.sumelectthermal: -607.773280 hartree
zpe.sumelectthermalent: -607.772336 hartree
zpe.sumelectthermalfe: -607.819997 hartree
dipole: 2.5543 -0.0008 1.8659
dipole: 3.1632
quadrupole: -64.1445 -57.4716 -64.5580
quadrupole: 0.0012 -5.2521 -0.0005
quadrupole: -2.0864 4.5864 -2.5000 0.0012 -5.2521 -0.0005
hfenergy: -607.9131288 hartree
pointgroup: C01 [X(C8H7F3)]
dipole: -1.0120308 0.0007461 0.7243009 debye
dipolederiv: -0.3978808 0.0186443 0.03698 -0.042612 -0.5980816 -0.2219682 0.0568894 -0.2649086 -0.5049415 -1.0209457 -0.0019271 -0.2359637 -0.0014797 -0.2869343 -0.0007583 -0.0863447 -0.0005143 -0.4036768 -0.3979406 -0.0177336 0.0363604 0.04359 -0.5947743 0.2227153 0.0557633 0.265715 -0.5081598 -0.1337734 0.0000757 0.1002568 0.0003119 0.0239706 -0.0001153 0.1609566 -0.0000504 -0.0696234 0.2430289 0.0005324 0.0495295 0.0006348 -0.01118 -0.0001476 0.0789758 -0.0001009 -0.0841022 1.7350953 0.0006966 0.0620866 0.0001101 1.4036837 0.0000301 -0.1440867 -0.0002704 1.4028423 -0.08874 0.0902213 0.0279801 0.0580286 0.0416499 0.0158452 0.0052715 0.0107007 -0.1336364 -0.0882421 -0.0904987 0.0285391 -0.0584587 0.040979 -0.0167318 0.0056068 -0.0116551 -0.1334799 -0.0413825 -0.0936987 0.0399313 -0.0870204 0.0818352 -0.025978 0.0449288 -0.0372848 -0.1246517 -0.0419771 0.0935026 0.0393161 0.0868518 0.0827864 0.0249544 0.0443266 0.0362818 -0.1250063 0.0753955 0.0004598 0.0883874 0.0004572 -0.0557917 -0.000054 0.0877184 -0.0000503 -0.1254564 0.0399109 0.0056557 -0.0089004 0.0630054 -0.0054844 0.0973576 -0.0227329 0.0534453 0.0652306 0.0401737 -0.0055367 -0.0085247 -0.0630078 -0.0066531 -0.096945 -0.0221576 -0.0530771 0.0661796 0.0459051 -0.0957024 -0.0444449 -0.083124 -0.0366041 -0.0259364 -0.0413735 -0.0287769 0.130351 0.0453308 0.0957115 -0.0450632 0.0831576 -0.0356827 0.0267178 -0.0419336 0.0295549 0.1300368 0.0398179 0.080069 -0.0391695 0.0913217 -0.0660782 0.0300074 -0.0453554 0.0276493 0.1439319 0.0403941 -0.0799236 -0.0386248 -0.0912137 -0.0669519 -0.028961 -0.0447519 -0.0266178 0.1442492 -0.0941698 -0.0005481 -0.0886762 -0.0005526 0.0893115 -0.0000322 -0.091701 -0.0000404 0.1299129 unknown
polarizability: 102.8271918|0.0693239|88.2282169|16.6978687|-0.0753579|51.2752031 unknown
InChI: InChI=1S/C8H7F3/c9-8(10,11)6-7-4-2-1-3-5-7/h1-5H,6H2
charge 0 multiplicity 1
18 atoms
F  1.987201 -1.133828 -0.904554
F  3.398281 0.00724 0.455252
F  1.983517 1.134742 -0.912037
C  1.04096 0.005341 1.049084
C  -0.395839 0.001557 0.545202
C  2.078276 0.00338 -0.068102
C  -1.07378 1.221721 0.301832
C  -1.069739 -1.222182 0.308647
C  -2.404143 1.219147 -0.172901
C  -2.400091 -1.226697 -0.166107
C  -3.070974 -0.005544 -0.40766
H  1.248692 -0.883472 1.670092
H  1.24595 0.898684 1.664478
H  -0.55919 2.174037 0.476752
H  -0.551985 -2.171789 0.488885
H  -2.918146 2.168629 -0.358528
H  -2.910923 -2.178906 -0.346436
H  -4.103367 -0.00826 -0.7745
