program: Gaussian 09
title: 000285371
version: EM64L-G09RevD.01
frameworkgroup: C1[X(C8H9F)]
method: RPBEPBE
basis: SDD
operation: Freq
keyword: #p
keyword: freq=noraman
keyword: PBEPBE/SDD
title: #p freq=noraman PBEPBE/SDD
converged: YES YES NO NO
title: Mulliken charges:
elementType: F C C C C C C C C H H H H H H H H H
charge: -0.248082 -0.565004 0.470118 -0.432125 -0.368363 -0.193928 -0.217057 -0.224174 -0.242634 0.238510 0.205539 0.227383 0.259107 0.201232 0.211366 0.224745 0.225525 0.227843
chargesum: 0.00000
title: Mulliken charges with hydrogens summed into heavy atoms:
elementType: F C C C C C C C C
charge: -0.248082 -0.120955 0.470118 -0.204742 -0.109256 0.218670 0.007687 0.001351 -0.014791
polarizability: 1.04444516e+02 4.10585993e+00 8.86823727e+01 -9.19808756e+00 3.37195394e+00 4.71844578e+01
1716.lowfreq: -15.8527 -0.0010 0.0003 0.0006 2.2233 13.5004 25.4163 99.6763 137.9821
frequency: 25.2656 99.5775 137.9725 264.6159 303.0534 403.8902 415.3916 485.2656 566.2725 617.2012 705.8107 750.0875 770.3822 820.3602 854.1360 917.2506 947.1983 976.3035 985.9828 992.7121 995.7939 1029.1493 1066.6893 1085.5710 1166.0833 1172.4046 1189.2228 1216.0159 1220.6203 1325.1072 1342.3462 1371.0279 1383.5354 1439.2197 1447.5547 1462.8567 1485.7406 1592.8169 1615.5614 2986.2870 3009.8193 3042.3116 3086.8909 3113.3674 3125.5755 3138.5118 3152.7421 3165.2335
redmass: 4.3742 6.2585 2.7235 4.7217 2.6737 2.8071 2.2143 4.1015 2.8603 6.2272 1.7426 3.0459 2.0279 3.0930 1.2476 1.3689 2.3848 1.4024 3.2826 2.7995 1.5201 2.0884 2.1394 1.6521 1.1334 1.0523 1.1208 2.1520 1.1865 1.3061 1.5012 1.3836 4.4903 1.8755 1.1948 1.1134 2.2647 6.0366 6.1266 1.0598 1.0586 1.0985 1.1112 1.0869 1.0867 1.0925 1.0957 1.1007
irintensity: 1.7160 4.8818 6.2341 1.0778 1.4669 0.0494 4.0778 10.1406 16.8849 0.2769 57.2254 14.0911 31.6340 17.8824 0.1565 2.3468 17.3392 0.0214 13.1972 5.3452 1.5959 7.7830 19.2793 10.2497 0.4621 0.2386 0.1396 0.1927 7.8479 2.2336 4.7198 5.0343 0.6005 5.6098 16.0843 3.3163 18.4397 1.0713 5.5016 20.1903 56.3932 23.9133 44.6129 9.7122 1.0270 29.7987 28.8277 13.6794
temp: 298.150 k
press: 1.00000 atm
elementType: 9 6 6 6 6 6 6 6 6 1 1 1 1 1 1 1 1 1
symmnumber: 1
zpe: 385597.0 jmol-1
zpe.correction: 0.146866 hartree
zpe.thermalcorrener: 0.154954 hartree
zpe.thermalcorrenthalpy: 0.155898 hartree
zpe.thermalcorrgfe: 0.112757 hartree
zpe.sumelectzpe: -409.426174 hartree
zpe.sumelectthermal: -409.418086 hartree
zpe.sumelectthermalent: -409.417142 hartree
zpe.sumelectthermalfe: -409.460283 hartree
dipole: 0.2637 -2.1266 -0.0227
dipole: 2.1430
quadrupole: -50.2502 -48.9476 -55.1985
quadrupole: 6.5513 -1.9384 1.5932
quadrupole: 1.2152 2.5179 -3.7331 6.5513 -1.9384 1.5932
hfenergy: -409.5730401 hartree
pointgroup: C01 [X(C8H9F1)]
dipole: -0.0351984 0.8403144 0.058867 debye
dipolederiv: -0.407748 0.0859169 0.0363999 0.1522997 -0.6731796 -0.0735907 0.0521802 -0.0160926 -0.306443 -0.0672949 0.0518321 0.0598915 0.0956468 0.0853739 0.002408 0.1434568 -0.0623464 0.0119169 0.2744376 0.0371677 0.0735303 0.0704704 -0.0322267 -0.0043381 0.1088865 -0.0158374 -0.0532923 -0.1510727 0.0258471 0.0223639 0.0445208 0.0734498 0.0071529 0.008543 0.0040332 -0.1671761 -0.0868771 -0.0877958 0.0320484 -0.1263533 -0.0106278 -0.0306522 -0.0028528 -0.0120728 -0.1482197 0.4698198 -0.0831583 -0.0333699 -0.1584189 0.7003812 0.0188288 -0.125571 0.0299726 0.4027084 0.0126077 -0.0722576 0.052505 -0.0891202 0.0527504 -0.0273687 0.046492 -0.0256064 -0.1307395 -0.0338179 0.0458565 0.0320241 0.0559643 0.124099 -0.0022034 0.0354888 0.0059313 -0.1405107 0.0548504 0.0356704 0.0671837 0.0353927 -0.0756963 0.0063747 0.0629668 0.0046874 -0.1540622 -0.0225909 0.0027707 -0.0463836 0.0138641 0.070709 0.0966035 -0.0717611 0.04194 -0.0756321 0.0380986 0.0231524 0.0082987 -0.0744992 -0.1413847 -0.0443612 0.0101315 -0.0037302 0.0994344 0.0616446 -0.0904024 -0.0263473 -0.0679058 -0.1041429 -0.0096932 -0.0255617 -0.0176595 0.1425968 0.0495773 0.0836458 -0.048578 0.0753395 0.0166432 0.0255021 -0.0420761 0.0221464 0.1375906 -0.2234021 -0.0868147 -0.0244829 -0.0313092 -0.013928 -0.0092317 -0.0385142 -0.029929 0.0724287 0.0936937 0.0374188 -0.0635592 0.0154963 -0.0034544 0.0250199 -0.0108368 0.0566795 -0.1262679 -0.0119163 0.0991487 -0.047858 0.1104292 -0.0350085 0.0362833 -0.0508179 0.034121 0.1434603 0.0601246 -0.0621105 -0.0211245 -0.0747099 -0.1109495 -0.0073596 -0.0255679 -0.0064175 0.1491016 -0.1101346 -0.0458876 -0.072542 -0.0471073 0.0771918 -0.0093743 -0.0745863 -0.0098195 0.1431058 unknown
polarizability: 103.8808975|1.999436|88.5020959|12.1556864|-0.6137329|47.9283528 unknown
InChI: InChI=1S/C8H9F/c9-7-6-8-4-2-1-3-5-8/h1-5H,6-7H2
charge 0 multiplicity 1
18 atoms
F  2.78354 -1.253087 -0.208309
C  1.616155 0.675805 0.768967
C  0.179473 0.343119 0.388171
C  -0.745457 1.376093 0.089903
C  -0.261226 -1.005492 0.31779
C  2.666281 0.213377 -0.249253
C  -2.07886 1.074864 -0.272989
C  -1.591856 -1.308462 -0.045979
C  -2.506382 -0.270374 -0.342449
H  1.877138 0.224405 1.745995
H  1.72865 1.77198 0.885353
H  -0.4227 2.423678 0.145172
H  0.445422 -1.812139 0.53902
H  3.66986 0.604777 -0.000129
H  2.389758 0.477139 -1.285674
H  -2.780121 1.886682 -0.49762
H  -1.916127 -2.354173 -0.098108
H  -3.539149 -0.507492 -0.62186
