program: Gaussian 09
title: 000285377
version: EM64L-G09RevD.01
frameworkgroup: C1[X(C9H7F5)]
method: RPBEPBE
basis: SDD
operation: Freq
keyword: #p
keyword: freq=noraman
keyword: PBEPBE/SDD
title: #p freq=noraman PBEPBE/SDD
converged: YES YES NO NO
title: Mulliken charges:
elementType: F F F F F C C C C C C C C C H H H H H H H
charge: -0.192637 -0.198571 -0.165305 -0.168175 -0.165387 0.500628 -0.629627 -0.485654 0.296591 -0.354102 -0.346859 0.147627 -0.204595 0.254678 0.240238 0.242090 0.267343 0.249200 0.265708 0.207342 0.239466
chargesum: 0.00000
title: Mulliken charges with hydrogens summed into heavy atoms:
elementType: F F F F F C C C C C C C C C
charge: -0.192637 -0.198571 -0.165305 -0.168175 -0.165387 0.500628 -0.147299 -0.218310 0.296591 -0.104902 -0.081151 0.354968 0.034871 0.254678
polarizability: 1.18772463e+02 -1.01566913e+00 1.00728197e+02 -1.18029906e+01 -1.04594329e+01 6.30552447e+01
1716.lowfreq: -8.4160 -0.0011 -0.0009 -0.0008 4.2856 6.5410 18.4018 24.0087 67.1281
frequency: 17.1277 23.7109 67.1245 85.5776 123.2826 153.6599 222.0351 266.5942 302.9721 327.0361 351.6748 397.0887 417.8417 431.6148 473.8474 488.1337 525.7827 583.7245 609.6126 681.8382 696.8833 734.5917 810.0302 816.8048 857.3558 910.0940 931.9864 944.7220 982.5065 987.8264 990.8214 994.4122 1017.2882 1053.4627 1072.2543 1109.9782 1189.9482 1198.4999 1204.3384 1293.7808 1301.6728 1315.1090 1323.4745 1361.8934 1392.6482 1445.1028 1453.1755 1483.4632 1603.4537 1624.0941 3014.1091 3064.7498 3072.1159 3141.3098 3156.0285 3157.8981 3175.2809
redmass: 14.0784 9.2490 10.0596 6.7370 7.6661 7.5404 5.2172 8.5637 6.6511 9.2784 4.4921 2.4697 4.7550 7.5083 5.7948 6.7966 8.3386 6.9262 11.6684 7.3643 2.6011 3.1906 4.7330 1.6625 3.3629 1.8412 1.6333 2.1644 5.4053 2.9433 5.1783 1.4357 5.7755 4.1655 2.8061 1.7867 1.1679 1.1379 1.7107 3.6929 1.6214 1.2545 1.2173 1.4305 7.8578 2.8748 1.1322 2.5297 6.1669 6.2483 1.0604 1.0895 1.1013 1.0877 1.0926 1.0926 1.0992
irintensity: 0.6765 1.4326 1.0613 3.3934 0.4934 1.3436 1.9677 2.2452 1.1134 6.4555 1.8921 1.9192 2.3885 2.8153 7.6924 8.0165 2.0592 1.7692 14.2598 3.9292 11.6370 65.1413 27.5585 25.2366 41.3855 20.9922 32.7593 22.8457 187.9321 112.3460 0.5944 4.4171 166.8484 78.6552 79.5578 7.2212 5.6717 6.0685 75.2848 231.6246 59.5750 14.4728 5.7372 4.6970 0.6856 21.0065 19.7188 5.5360 3.8658 3.1161 10.7634 64.1055 5.9527 4.0766 3.1308 5.4942 7.9195
temp: 298.150 k
press: 1.00000 atm
elementType: 9 9 9 9 9 6 6 6 6 6 6 6 6 6 1 1 1 1 1 1 1
symmnumber: 1
zpe: 373434.9 jmol-1
zpe.correction: 0.142234 hartree
zpe.thermalcorrener: 0.154894 hartree
zpe.thermalcorrenthalpy: 0.155838 hartree
zpe.thermalcorrgfe: 0.100312 hartree
zpe.sumelectzpe: -845.348777 hartree
zpe.sumelectthermal: -845.336117 hartree
zpe.sumelectthermalent: -845.335172 hartree
zpe.sumelectthermalfe: -845.390699 hartree
dipole: -3.5975 1.8921 2.7399
dipole: 4.9019
quadrupole: -82.1709 -73.3312 -80.8733
quadrupole: 5.3213 -10.7847 -4.5034
quadrupole: -3.3791 5.4606 -2.0815 5.3213 -10.7847 -4.5034
hfenergy: -845.4910107 hartree
pointgroup: C01 [X(C9H7F5)]
dipole: -1.4292039 0.7675234 1.0429082 debye
dipolederiv: -0.3937032 0.1302082 0.0769089 0.0613136 -0.5482859 -0.168167 0.0212011 -0.2764263 -0.4693293 -0.431371 0.087496 -0.1044477 0.1304856 -0.5202762 0.153651 -0.2264946 0.1720423 -0.4862781 -0.6898316 -0.0098508 0.2764937 -0.0131539 -0.3327826 0.0949714 0.2329112 0.0970053 -0.5689013 -0.7156187 0.1132293 -0.2534276 0.1108049 -0.3384268 -0.028941 -0.3290298 -0.0005089 -0.6700201 -0.4301924 0.0542854 -0.0070723 0.0578126 -0.8346823 -0.1129652 -0.0360048 -0.0639016 -0.2963638 0.2441799 0.1841456 -0.0749249 0.1506134 -0.0259589 -0.0154141 -0.092225 -0.0355984 -0.0718948 -0.1137843 -0.0871556 -0.1236723 -0.07538 -0.0021398 -0.0747792 -0.1609033 -0.0813986 -0.0441802 -0.0704541 -0.1151387 0.014868 0.037777 0.0321052 -0.0418196 -0.0211303 0.0414719 -0.0951911 -0.3117883 0.1240356 0.0048039 0.1869419 -0.1681338 -0.0467754 0.0662309 -0.0776972 -0.1344327 0.0509104 -0.0891705 -0.0210382 -0.0834863 -0.0103502 -0.0156162 0.0260675 -0.019881 -0.1062227 0.0214072 0.0659651 -0.0618195 -0.1013866 -0.0243542 -0.0017657 -0.0314768 -0.0388779 -0.0944481 0.9410347 -0.1340774 0.0866657 -0.1095513 1.0882466 0.0536232 0.2981199 0.1507103 0.986075 -0.1523326 -0.0319007 0.0094372 -0.003591 0.1354331 -0.075608 -0.0044487 -0.0810404 -0.103035 1.9857972 -0.2901973 -0.0144622 -0.327351 1.5141379 0.081377 0.091042 0.0278813 1.5180979 -0.020842 0.0139645 0.0643978 0.0667026 0.0147962 -0.0932706 0.0640122 -0.0319795 0.0558386 0.0489013 0.0348037 -0.0550779 -0.0295252 -0.0263185 0.1038908 0.0054486 0.0732339 0.0456877 0.1218606 -0.0127295 0.0185971 -0.0075983 -0.008629 0.0488905 0.0150485 0.0427239 0.125002 -0.0366279 0.0847586 0.0301865 0.0728134 0.0721088 0.007682 0.0257878 0.0072348 0.1306922 0.0134584 -0.0498633 0.0506137 -0.0414983 0.0905756 0.0301933 0.0537412 0.0353706 0.1370274 -0.1439988 -0.0801638 0.0670883 -0.0891659 -0.0291834 0.0364832 -0.0215117 -0.0084271 0.0084156 0.0829948 0.0073557 0.0158818 0.0064229 -0.0778816 0.0643597 0.0236141 0.0680625 0.1334609 unknown
polarizability: 119.1633603|-1.0934543|100.4712938|-10.860951|-10.8796252|62.921251 unknown
InChI: InChI=1S/C9H7F5/c10-8(11)5-6-2-1-3-7(4-6)9(12,13)14/h1-4,8H,5H2
charge 0 multiplicity 1
21 atoms
F  -2.586159 -1.765446 -0.828559
F  -3.703293 0.249145 -0.867267
F  3.422104 -0.087942 -1.039218
F  3.29342 -0.421524 1.196021
F  2.346294 -1.913812 -0.218323
C  -1.113786 0.367393 0.608191
C  -2.385043 -0.300043 1.108994
C  0.088564 -0.368932 0.510486
C  1.263044 0.250421 0.026497
C  -1.119514 1.729495 0.215186
C  1.254952 1.608504 -0.366733
C  -3.291105 -0.825711 -0.004403
C  0.054814 2.343297 -0.272408
C  2.546758 -0.527132 -0.01724
H  -2.98785 0.407992 1.707058
H  -2.14304 -1.158342 1.761878
H  0.10887 -1.42644 0.793269
H  -2.04893 2.305872 0.278238
H  2.167746 2.076441 -0.747748
H  -4.209887 -1.325854 0.351209
H  0.035739 3.393416 -0.580527
