program: Gaussian 09
title: 000285367
version: EM64L-G09RevD.01
frameworkgroup: C1[X(C9H9F3)]
method: RPBEPBE
basis: SDD
operation: Freq
keyword: #p
keyword: freq=noraman
keyword: PBEPBE/SDD
title: #p freq=noraman PBEPBE/SDD
converged: YES YES NO NO
title: Mulliken charges:
elementType: F F F C C C C C C C C C H H H H H H H H H
charge: -0.162973 -0.172259 -0.161876 0.461331 -0.674124 -0.496846 0.448074 -0.381530 0.426647 -0.419933 -0.208583 -0.807610 0.258211 0.257925 0.239898 0.239051 0.234743 0.228257 0.229840 0.224402 0.237356
chargesum: 0.00000
title: Mulliken charges with hydrogens summed into heavy atoms:
elementType: F F F C C C C C C C C C
charge: -0.162973 -0.172259 -0.161876 0.461331 -0.157988 -0.256948 0.448074 -0.142479 0.426647 -0.185191 0.019674 -0.116012
polarizability: 1.17074105e+02 4.83560957e+00 1.03797141e+02 1.48505185e+01 -4.60907860e+00 6.05094720e+01
1716.lowfreq: -10.7782 -8.3845 -0.0010 -0.0006 -0.0005 3.9450 13.7213 23.9170 54.7248
frequency: 12.9640 23.6272 54.7134 79.1185 202.9039 223.5453 231.7488 283.4865 327.2828 397.3729 430.1576 450.7559 465.9085 510.4119 517.3745 562.6809 630.5501 700.0860 740.9729 757.0376 803.2098 873.0543 897.5104 914.5808 921.9963 984.1672 988.2173 997.1220 1021.3305 1026.5025 1050.1194 1103.8892 1167.5935 1187.1565 1201.2068 1244.0912 1262.1389 1315.7912 1339.3422 1381.4498 1399.9311 1435.5722 1449.6831 1470.9058 1474.2916 1487.8244 1603.1511 1621.2451 2977.6266 3026.9884 3056.4448 3085.4069 3088.2339 3115.7210 3123.1892 3133.6832 3157.6727
redmass: 5.6350 1.0334 7.3270 6.8312 3.4620 4.3660 4.7094 10.3493 3.0588 2.2345 3.0356 10.0420 6.9019 4.7951 5.0171 5.9838 6.3622 2.5010 3.2325 4.3546 1.7626 2.6383 1.3396 1.6337 2.2941 1.3769 3.3903 2.1060 7.3841 1.9170 1.5689 1.6158 1.6441 1.1150 5.9036 1.4784 2.9389 1.2608 1.6351 5.9289 1.2579 2.4897 1.0927 1.0562 1.4331 1.7625 5.8392 6.2639 1.0374 1.0600 1.0975 1.0988 1.1022 1.0916 1.0867 1.0920 1.0995
irintensity: 0.4322 0.5425 0.3409 1.4051 3.2062 0.8285 0.3524 1.2093 0.8829 0.3087 1.9971 5.2800 1.1947 8.4943 0.8093 20.5127 6.6152 16.4183 27.6622 40.2632 11.5362 49.9786 2.0123 3.9770 7.2271 0.8999 12.2823 29.8354 230.2042 53.5990 15.1402 17.8547 12.5613 4.6587 182.6930 50.9238 5.6442 2.4775 34.8847 0.7092 12.1565 3.5235 18.2725 14.1800 13.3932 20.4016 5.2463 15.5298 29.1699 12.2739 19.5616 18.3708 2.8127 13.0952 3.2407 21.9188 20.2780
temp: 298.150 k
press: 1.00000 atm
elementType: 9 9 9 6 6 6 6 6 6 6 6 6 1 1 1 1 1 1 1 1 1
symmnumber: 1
zpe: 412656.3 jmol-1
zpe.correction: 0.157172 hartree
zpe.thermalcorrener: 0.168676 hartree
zpe.thermalcorrenthalpy: 0.169620 hartree
zpe.thermalcorrgfe: 0.116635 hartree
zpe.sumelectzpe: -647.012630 hartree
zpe.sumelectthermal: -647.001126 hartree
zpe.sumelectthermalent: -647.000182 hartree
zpe.sumelectthermalfe: -647.053168 hartree
dipole: -2.7636 0.2295 1.8195
dipole: 3.3168
quadrupole: -70.9592 -63.9894 -70.7743
quadrupole: 2.5416 5.5438 -1.0102
quadrupole: -2.3849 4.5849 -2.2000 2.5416 5.5438 -1.0102
hfenergy: -647.1698026 hartree
pointgroup: C01 [X(C9H9F3)]
dipole: -1.0880969 0.0578621 0.7179906 debye
dipolederiv: -0.4141089 -0.0267464 0.0000615 -0.0827197 -0.6201351 -0.208996 0.0167617 -0.2544186 -0.4633605 -1.0267073 0.0875578 -0.2199587 0.1168299 -0.2993854 0.0281065 -0.0731281 0.0045567 -0.3946752 -0.3982459 -0.0431315 0.0719852 0.0246442 -0.5505813 0.2173605 0.096884 0.2612738 -0.5496554 0.238251 -0.0217147 0.0363074 -0.0479893 0.0407757 -0.0204884 0.0659102 -0.0203539 -0.0772223 -0.1187094 0.0286745 0.0985265 0.035108 0.0154896 -0.0254997 0.1611901 -0.0283676 -0.0745382 -0.1805227 -0.1669853 0.0251597 -0.0612045 -0.0034963 -0.0329814 -0.0106408 -0.0503096 -0.1588508 0.1079459 0.2206357 0.0151635 0.2431251 0.2634166 0.0410869 0.0324364 0.0565843 -0.0057851 -0.1121946 0.0868306 0.0125376 0.0680978 -0.0279129 -0.0021741 -0.011745 -0.0110286 -0.1584295 1.7450713 -0.026155 0.0525159 -0.0659844 1.3948958 -0.0157637 -0.1539909 0.0092853 1.3951626 0.0287791 -0.0284881 0.0738009 -0.1174303 -0.1636144 -0.0399235 0.0825495 -0.0141742 -0.1480504 -0.0019004 -0.0553679 0.0491979 -0.0321527 0.1185849 -0.0343912 0.0506498 -0.0518806 -0.1046844 0.0376367 -0.0580017 -0.0018522 -0.1318679 -0.1181448 -0.0271297 -0.0151017 -0.0262664 0.0594066 0.049484 -0.0019354 0.0093908 0.0592995 -0.0033793 0.1007338 -0.017334 0.0611667 0.0521605 0.0238941 -0.0161835 -0.0218941 -0.0776356 -0.0054798 -0.0864317 -0.0233698 -0.0431503 0.0778263 0.0761705 0.0633731 -0.0352121 0.0646497 -0.0646957 0.0433934 -0.0337733 0.041614 0.1208199 0.0086614 -0.1097405 -0.0379073 -0.0961678 -0.0099087 -0.0059683 -0.0363005 -0.0080713 0.1378371 -0.1041642 0.0202105 -0.0800638 0.001182 0.0888284 0.0095337 -0.080771 0.015047 0.1282875 0.0596389 0.0599393 -0.0336281 0.0627964 -0.0943508 0.0466433 -0.0394707 0.0481191 0.138367 0.0659355 -0.0346798 -0.0309871 -0.0540844 0.004583 0.0871661 0.029903 0.1294885 -0.0619086 -0.1274322 -0.0000947 -0.0521223 0.1052448 0.057251 0.0285699 -0.0630844 0.0081746 0.0945598 0.0425171 0.0220029 0.0689786 -0.0137409 -0.0227405 -0.1028464 0.0224256 -0.1272889 -0.007267 unknown
polarizability: 116.8744351|5.0300726|104.1072414|14.9138619|-3.9033766|60.3990418 unknown
InChI: InChI=1S/C9H9F3/c1-7-3-2-4-8(5-7)6-9(10,11)12/h2-5H,6H2,1H3
charge 0 multiplicity 1
21 atoms
F  2.034156 -1.347916 -0.841389
F  3.660611 -0.355631 0.387973
F  2.406575 0.880946 -1.040551
C  -0.076686 0.290609 0.559634
C  1.357424 0.085701 1.028856
C  -0.94957 -0.814074 0.425745
C  -2.287997 -0.65075 -0.014903
C  -0.549001 1.590801 0.252536
C  2.340401 -0.178612 -0.105513
C  -2.741543 0.658362 -0.314791
C  -1.878864 1.770667 -0.183166
C  -3.202623 -1.853642 -0.166281
H  1.434065 -0.776027 1.714916
H  1.730747 0.974997 1.566081
H  -0.582758 -1.822212 0.659397
H  0.120557 2.453497 0.348505
H  -3.774205 0.806845 -0.652742
H  -2.244412 2.776149 -0.419125
H  -3.250015 -2.446015 0.766482
H  -4.230919 -1.548946 -0.425997
H  -2.842141 -2.531348 -0.963366
