program: Gaussian 09
title: 000285372
version: EM64L-G09RevD.01
frameworkgroup: C1[X(C13H17FO)]
method: RPBEPBE
basis: SDD
operation: Freq
keyword: #p
keyword: freq=noraman
keyword: PBEPBE/SDD
title: #p freq=noraman PBEPBE/SDD
converged: YES YES NO NO
title: Mulliken charges:
elementType: F O C C C C C C C C C C C C C H H H H H H H H H H H H H H H H H
charge: -0.222467 -0.291892 0.301169 -0.678822 -0.691052 -0.713082 0.302989 0.489936 -0.447852 0.436285 -0.398440 -0.395665 -0.404427 -0.377525 -0.807902 0.231445 0.205275 0.245945 0.227248 0.235629 0.204405 0.243325 0.222164 0.231348 0.234711 0.220631 0.261801 0.226625 0.225995 0.234174 0.223397 0.224629
chargesum: 0.00000
title: Mulliken charges with hydrogens summed into heavy atoms:
elementType: F O C C C C C C C C C C C C C
charge: -0.222467 -0.291892 0.301169 0.003842 -0.023770 -0.016244 0.302989 0.489936 -0.213141 0.436285 -0.177808 -0.133865 -0.177801 -0.151530 -0.125702
polarizability: 2.61227937e+02 -2.49176530e+00 1.36494685e+02 7.34440702e+00 1.42756419e+00 8.87523839e+01
1716.lowfreq: -12.5513 -0.0010 -0.0006 -0.0001 4.3456 8.4998 15.1209 28.7467 39.3354
frequency: 8.7277 27.7187 39.3013 56.5023 66.8114 112.0455 160.1135 175.6129 208.4893 226.1407 238.9788 252.5470 267.3658 287.0785 330.4416 357.2398 369.5557 395.7955 408.2775 418.4126 442.2928 520.6606 524.5060 552.3490 631.7753 660.3012 676.4080 724.9890 758.7434 782.4426 804.7137 817.5090 846.7708 870.3217 882.1750 913.4322 922.7557 953.0593 956.6035 975.0103 985.1222 1011.3483 1027.7460 1029.1179 1046.1402 1096.9491 1130.1866 1179.5221 1197.7378 1226.4064 1247.9075 1258.4173 1272.9672 1304.5851 1323.9183 1372.9822 1379.9401 1382.1201 1395.8211 1404.8844 1415.0798 1445.8129 1461.8106 1465.8768 1470.8221 1471.7272 1472.4497 1476.3750 1494.4724 1509.6986 1570.3444 1623.2638 1683.0814 2971.3382 2989.1568 2991.0404 2996.2989 3051.9580 3081.9228 3085.2526 3088.0608 3093.2950 3097.6766 3102.4664 3109.1565 3114.3469 3119.5108 3134.1457 3138.1197 3182.0578
redmass: 1.0330 3.1671 3.7385 4.3918 4.8476 4.2793 3.4273 1.1190 4.0207 1.4731 1.1578 1.6478 4.7277 2.8890 2.9986 2.9250 3.1928 2.5937 2.8588 2.7688 3.1508 2.8743 4.7800 4.7572 6.8593 6.7127 6.1915 2.8217 5.9781 3.9179 4.3622 1.3502 1.2923 2.0740 2.2591 1.5838 1.5647 1.2058 1.3708 1.3734 1.4125 2.9370 1.4243 1.4244 1.5575 4.0741 1.3874 2.1088 1.1339 2.5024 2.5204 2.9936 3.0699 1.9368 1.3882 3.7617 1.2382 1.2378 1.2269 1.2080 3.0954 1.0474 1.0499 1.0502 1.0967 1.0669 1.0574 1.0588 1.0551 2.6796 5.7273 6.2882 8.9774 1.0387 1.0357 1.0359 1.0365 1.0946 1.0997 1.0986 1.0992 1.1010 1.0990 1.1003 1.0868 1.1002 1.0902 1.0958 1.0890 1.0934
irintensity: 0.4679 0.4797 2.0139 0.9956 0.9248 0.3969 2.0303 0.2167 1.4481 0.8804 0.2452 0.3123 4.7869 1.4392 2.5300 1.6221 1.2486 0.2565 0.0598 1.3248 3.6174 22.9051 9.9720 24.0507 4.8869 12.3908 16.1331 3.2646 11.3153 10.9378 29.5160 15.8480 10.0255 46.2472 67.4774 1.2998 0.7473 0.0165 6.5435 0.2168 1.5966 4.3775 0.5564 0.4307 23.0256 424.2252 73.7805 75.4031 1.3293 0.3117 52.4568 31.3836 55.8511 22.6395 8.7884 7.0008 32.3035 34.2698 6.0727 21.9668 4.8307 0.8425 1.6974 1.5524 15.0037 6.3003 11.6062 9.1320 24.5738 16.3736 2.6507 0.3998 310.1581 49.0370 15.8622 12.8519 29.9804 25.4498 18.7562 5.6492 14.1499 13.4923 63.3521 31.1466 14.2094 22.8061 27.6840 28.3524 15.5572 2.9732
temp: 298.150 k
press: 1.00000 atm
elementType: 9 8 6 6 6 6 6 6 6 6 6 6 6 6 6 1 1 1 1 1 1 1 1 1 1 1 1 1 1 1 1 1
symmnumber: 1
zpe: 692664.2 jmol-1
zpe.correction: 0.263822 hartree
zpe.thermalcorrener: 0.280360 hartree
zpe.thermalcorrenthalpy: 0.281304 hartree
zpe.thermalcorrgfe: 0.217246 hartree
zpe.sumelectzpe: -679.504860 hartree
zpe.sumelectthermal: -679.488322 hartree
zpe.sumelectthermalent: -679.487378 hartree
zpe.sumelectthermalfe: -679.551436 hartree
dipole: -1.4139 -0.7485 1.6088
dipole: 2.2688
quadrupole: -69.9701 -85.5284 -94.0071
quadrupole: 0.4317 -2.7508 0.0656
quadrupole: 13.1984 -2.3598 -10.8386 0.4317 -2.7508 0.0656
hfenergy: -679.768682 hartree
pointgroup: C01 [X(C13H17F1O1)]
dipole: -0.5519274 0.4868044 -0.505163 debye
polarizability: 261.2061338|7.0556134|129.9172407|-1.6127031|16.8576623|95.3516308 unknown
InChI: InChI=1S/C13H17FO/c1-10-5-7-11(8-6-10)9-12(14)15-13(2,3)4/h5-9H,1-4H3
charge 0 multiplicity 1
32 atoms
F  -1.101606 -1.509507 -0.339475
O  -2.535344 0.028307 0.685958
C  -3.694408 0.038755 -0.341399
C  -4.16658 -1.413533 -0.539993
C  -4.750856 0.888486 0.380266
C  -3.209036 0.691265 -1.646465
C  -1.261199 -0.222353 0.281727
C  1.243602 0.33121 0.275364
C  -0.185897 0.580393 0.507099
C  4.084989 0.013662 -0.108413
C  2.160945 1.371061 0.60833
C  1.784379 -0.878265 -0.253685
C  3.548117 1.215398 0.421175
C  3.1740 -1.025131 -0.434874
C  5.57698 -0.147149 -0.341368
H  -4.396025 -1.87555 0.435524
H  -5.084172 -1.427408 -1.157205
H  -3.394722 -2.019974 -1.040025
H  -4.384082 1.916567 0.541222
H  -4.989621 0.446965 1.362826
H  -5.677288 0.931906 -0.220135
H  -2.412625 0.095557 -2.125853
H  -4.053974 0.762316 -2.354695
H  -2.825169 1.709775 -1.461967
H  -0.447158 1.549592 0.948195
H  1.774712 2.310038 1.025281
H  1.11448 -1.700913 -0.514971
H  4.225618 2.034757 0.691953
H  3.563013 -1.968605 -0.838478
H  5.858374 0.174546 -1.363515
H  6.165928 0.461969 0.367124
H  5.892623 -1.199937 -0.231829
