program: Gaussian 09
title: 000285356
version: EM64L-G09RevD.01
frameworkgroup: C1[X(C8H6N2O4)]
method: RPBEPBE
basis: SDD
operation: Freq
keyword: #pfreq=noraman
keyword: PBEPBE/SDD
title: #p freq=noraman PBEPBE/SDD
converged: NO YES NO NO
title: Mulliken charges:
elementType: O O O O N N C C C C C C C C H H H H H H
charge: -0.254962 -0.266352 -0.161380 -0.233201 -0.176457 -0.395930 -0.102175 -0.115629 0.229535 -0.062189 -0.302676 0.170410 -0.283756 0.153857 0.307583 0.292839 0.289970 0.283595 0.365276 0.261644
chargesum: 0.00000
title: Mulliken charges with hydrogens summed into heavy atoms:
elementType: O O O O N N C C C C C C C C
charge: -0.254962 -0.266352 -0.161380 -0.233201 -0.176457 -0.030654 0.205408 0.177210 0.229535 0.227781 -0.019081 0.170410 -0.022112 0.153857
polarizability: 1.61074414e+02 2.92093292e+00 1.08508643e+02 8.38955526e-02 -4.02496624e-01 5.97186097e+01
1716.lowfreq: -12.1713 -3.8953 0.0003 0.0008 0.0009 4.6605 15.6692 60.8759 81.4653
frequency: 12.6993 60.8751 81.4602 152.1438 173.7636 226.1621 261.0051 287.5145 360.8957 379.0291 414.4457 484.0914 515.7625 540.7838 587.6611 650.9300 678.1698 684.1657 701.8806 739.9898 763.7501 771.4892 780.8606 799.8386 811.1574 857.4160 937.4252 940.6485 957.6600 969.2250 1004.8473 1039.8362 1065.5263 1117.9346 1169.8955 1208.0951 1232.9477 1264.6950 1302.9545 1329.6629 1345.8869 1370.3876 1415.6528 1598.0368 1607.1056 1638.6907 1667.5990 1730.4751 3045.3089 3195.6875 3206.2804 3220.5215 3235.1543 3520.6653
redmass: 5.4402 7.5440 9.1793 5.8089 8.2435 9.1037 7.6211 6.6526 5.4086 9.7173 3.5249 5.3947 6.4760 6.0790 7.1127 3.3117 8.1676 3.1217 2.3091 7.8532 3.7524 2.1835 3.3166 7.1197 1.8662 2.1683 2.8035 3.0789 1.2892 1.5078 2.8357 2.5704 2.4882 1.3714 5.3209 2.2911 1.4256 1.7505 1.7696 3.1425 1.3205 1.7833 3.0092 5.6991 6.6959 10.7436 6.1505 12.4520 1.0847 1.0896 1.0896 1.0991 1.1101 1.0771
irintensity: 9.0711 0.2516 4.3962 4.8719 6.1807 4.4219 4.6073 2.3356 6.2790 12.4530 13.6404 1.6561 8.8137 16.9668 4.7950 4.0719 1.4803 21.6595 9.8923 41.6490 33.5010 28.7545 57.6005 35.5357 111.3644 69.5330 2.9760 8.7840 0.6858 4.0469 72.6362 109.2799 72.8346 12.0972 37.2383 41.9999 37.6515 124.7627 28.7472 93.4547 11.1406 31.4306 93.6349 34.1862 13.5134 273.9805 782.8364 354.7695 5.5398 4.9077 1.4305 0.1318 0.0917 65.3139
temp: 298.150 k
press: 1.00000 atm
elementType: 8 8 8 8 7 7 6 6 6 6 6 6 6 6 1 1 1 1 1 1
symmnumber: 1
zpe: 359578.0 jmol-1
zpe.correction: 0.136956 hartree
zpe.thermalcorrener: 0.148226 hartree
zpe.thermalcorrenthalpy: 0.149170 hartree
zpe.thermalcorrgfe: 0.097590 hartree
zpe.sumelectzpe: -717.861095 hartree
zpe.sumelectthermal: -717.849825 hartree
zpe.sumelectthermalent: -717.848881 hartree
zpe.sumelectthermalfe: -717.900461 hartree
dipole: -1.9022 1.7065 1.9522
dipole: 3.2159
quadrupole: -103.4073 -83.8816 -78.2320
quadrupole: -4.7701 -8.4720 1.3075
quadrupole: -14.9004 4.6254 10.2750 -4.7701 -8.4720 1.3075
hfenergy: -717.9980511 hartree
pointgroup: C01 [X(C8H6N2O4)]
dipole: 0.7303933 0.5913196 -0.8471326 debye
dipolederiv: -1.2142053 0.1875893 0.2069881 0.2553181 -0.3932515 0.0270869 0.3518379 -0.0298357 -0.5288598 -0.6437457 -0.1139181 -0.0019196 -0.1708583 -1.2611015 -0.044409 -0.0164149 -0.0027295 -0.367875 -0.9794248 0.3107294 0.0107523 0.5725487 -0.6075269 0.0595996 -0.1378302 0.1457037 -0.4026927 -1.3490136 -0.3031447 -0.0684602 -0.1408288 -0.5224486 -0.0093559 -0.0997685 -0.0328996 -0.3692283 -0.8905791 0.3414842 -0.002135 -0.6270648 -1.1493403 -0.0182528 -0.0675647 0.0480171 -0.1857862 -0.8888517 -0.4240888 -0.0193112 -0.5260061 -0.867073 -0.0470845 -0.0542056 -0.0496435 -0.347302 1.2511239 0.0799275 -0.0023307 0.0668039 0.3374014 0.0304003 0.2837367 -0.0259541 0.3605185 0.0224955 -0.1514336 -0.0128609 -0.1321558 -0.0100818 -0.0775115 -0.2084337 -0.0040294 -0.0599986 1.2975357 -0.0572188 0.0331815 0.1119506 1.7330934 0.0516704 0.0469169 -0.0254674 0.3100065 0.4971993 0.2291429 0.0498513 0.9352234 0.6972004 0.0376542 0.1384916 0.0257011 0.0056514 -0.2518843 0.0895258 -0.1496982 0.1786593 -0.2848885 0.0964048 -0.1241947 0.112566 -0.1310031 1.6658979 -0.5807886 -0.1694869 -0.8230598 0.8296137 -0.2186647 -0.2394841 -0.2375043 0.7773053 -0.9084626 -0.1169107 -0.0288421 0.1349281 -0.1223513 0.0159048 -0.0739788 -0.02097 -0.2357807 1.749335 0.377396 0.1136376 0.1702327 1.0511388 0.0292609 0.1560461 0.0480589 0.2851414 0.0039021 0.0380924 0.0202847 -0.1033797 0.0459175 -0.0137723 0.0239221 -0.0288699 0.0486334 0.1481556 0.0564928 -0.0155084 0.0383313 0.1052245 0.0573365 -0.0126076 0.0305137 0.0896865 0.1113315 0.0732997 -0.0134365 0.0616419 0.0833623 -0.0119006 -0.002791 -0.001289 0.1558828 0.1007939 0.0146438 0.0735161 0.0535833 0.15372 0.0366312 0.0722943 0.0432426 0.0692097 0.2094978 -0.0342716 -0.0149805 -0.0669442 0.1669726 -0.0024582 -0.0140761 0.0022789 0.3373018 0.0688988 -0.016549 -0.0092414 0.011076 0.0144188 0.0014599 -0.0218957 0.0031105 0.189189 unknown
polarizability: 161.1105962|-2.5065069|107.9833946|-1.104712|-4.7853287|60.2076764 unknown
InChI: InChI=1S/C8H6N2O4/c11-5-3-4-10(8(13)9-5)6-1-2-7(12)14-6/h1-4,6,9H
charge 0 multiplicity 1
20 atoms
O  1.988181 -0.321242 0.887358
O  -1.012923 2.397916 0.096182
O  4.013774 -1.315837 0.222938
O  -4.16988 -1.05672 -0.214495
N  -0.264818 0.17832 0.201071
N  -2.567902 0.636951 -0.030363
C  1.118371 0.718193 0.340557
C  1.752685 1.121984 -0.986716
C  -1.281562 1.162744 0.091522
C  -0.540516 -1.188611 0.161295
C  2.899258 0.420937 -1.1709
C  3.114486 -0.507217 -0.024342
C  -1.819771 -1.665092 0.019856
C  -2.953594 -0.747024 -0.090686
H  1.07101 1.574693 1.036215
H  1.303145 1.884802 -1.623416
H  0.325134 -1.842248 0.282385
H  3.598251 0.468036 -2.005253
H  -3.32583 1.324058 -0.103287
H  -2.0250 -2.735542 0.003275
