program: Gaussian 09
title: 000285359
version: EM64L-G09RevD.01
frameworkgroup: C1[X(C13H10N2O)]
method: RPBEPBE
basis: SDD
operation: Freq
keyword: #p
keyword: freq=noraman
keyword: PBEPBE/SDD
title: #p freq=noraman PBEPBE/SDD
converged: YES YES NO NO
title: Mulliken charges:
elementType: O N N C C C C C C C C C C C C C H H H H H H H H H H
charge: -0.265457 -0.012906 -0.019659 0.357309 0.318280 -0.233364 -0.068876 0.298502 -0.537937 -0.297081 -0.296474 -0.195103 -0.203122 -0.373883 -0.370813 -0.488298 0.286903 0.233172 0.229410 0.232545 0.228844 0.244205 0.241713 0.235908 0.219624 0.236557
chargesum: 0.00000
title: Mulliken charges with hydrogens summed into heavy atoms:
elementType: O N N C C C C C C C C C C C C C
charge: -0.265457 -0.012906 -0.019659 0.357309 0.318280 -0.233364 -0.068876 0.298502 -0.251035 -0.063908 -0.067064 0.037442 0.025723 -0.129678 -0.129100 0.203791
polarizability: 2.59781571e+02 -1.03427173e+01 1.82686598e+02 1.67016732e-02 9.74886840e-03 6.43147281e+01
1716.lowfreq: -31.7544 -12.3639 -9.1514 -0.0005 -0.0004 0.0002 4.0898 81.6064 96.4835
frequency: -31.6620 81.6044 96.4831 134.6793 216.8543 218.1746 238.1179 245.2291 299.1393 339.4400 401.0876 410.4186 420.8396 439.9624 481.8634 511.0766 574.1100 604.4540 617.5878 632.4437 634.0969 702.1201 771.8332 780.7275 787.9411 798.5965 844.3362 870.3628 898.7279 935.0680 939.9483 939.9616 967.3756 974.0170 984.7669 1040.2685 1051.0947 1072.4831 1108.1847 1113.7819 1141.8109 1160.9622 1180.1278 1218.1656 1246.0580 1276.2983 1325.0584 1342.7982 1353.3550 1373.2026 1392.6038 1417.7946 1425.3748 1450.3642 1450.5799 1452.8859 1469.8772 1508.4203 1546.8028 1577.6833 1583.8122 1608.3732 3004.8233 3120.7491 3121.3469 3121.9909 3125.0558 3136.7545 3147.9703 3168.3446 3171.8811 3185.9867
redmass: 3.0444 4.9781 4.4631 4.2986 2.3952 1.3770 4.1448 5.0670 4.9904 4.4157 7.1671 6.3818 3.9085 4.2669 7.2452 3.0082 4.0017 7.5404 6.8197 3.4098 5.7990 6.7404 2.8188 5.8558 2.1561 1.3504 2.7091 5.9714 1.6388 1.4712 3.3542 1.5805 9.0204 1.4055 1.3740 2.5290 2.3106 3.6485 1.2407 2.4320 1.2852 1.6769 1.4566 1.4496 2.0922 3.7919 2.5713 4.8376 2.6855 2.1931 3.8230 2.0889 2.3099 1.4127 1.0537 1.0738 3.7965 4.1839 7.3676 5.8029 6.2435 6.9523 1.0279 1.1047 1.0894 1.1052 1.0901 1.0898 1.0883 1.0991 1.0992 1.0920
irintensity: 10.2843 0.0060 0.0122 0.9399 2.7682 1.0080 3.9399 0.1424 2.2897 5.3595 5.5950 7.4564 0.0052 0.0844 1.1877 5.3564 2.1806 0.9556 0.5378 1.6811 14.8211 0.1936 5.5318 0.6581 10.6152 91.2924 0.4531 4.8044 38.2814 0.3616 7.8470 2.1327 14.9452 0.3380 0.6194 1.2842 3.7224 44.4813 0.1428 45.5289 0.2656 66.8464 35.9437 3.2998 1.7170 97.7628 125.3832 11.4944 6.2043 40.3539 41.0687 24.7224 15.8145 0.6726 12.3021 39.1473 140.1889 15.0164 10.0198 33.6868 53.3632 121.8653 76.2002 28.8371 26.5705 35.5695 15.0442 13.9794 3.7228 27.4105 31.0612 2.1680
temp: 298.150 k
press: 1.00000 atm
elementType: 8 7 7 6 6 6 6 6 6 6 6 6 6 6 6 6 1 1 1 1 1 1 1 1 1 1
symmnumber: 1
zpe: 520295.2 jmol-1
zpe.correction: 0.198170 hartree
zpe.thermalcorrener: 0.209660 hartree
zpe.thermalcorrenthalpy: 0.210604 hartree
zpe.thermalcorrgfe: 0.160774 hartree
zpe.sumelectzpe: -685.001527 hartree
zpe.sumelectthermal: -684.990037 hartree
zpe.sumelectthermalent: -684.989093 hartree
zpe.sumelectthermalfe: -685.038923 hartree
dipole: -0.8367 4.3240 0.0109
dipole: 4.4042
quadrupole: -78.2137 -86.2199 -96.4031
quadrupole: 6.0175 -0.0310 -0.0181
quadrupole: 8.7319 0.7257 -9.4575 6.0175 -0.0310 -0.0181
hfenergy: -685.1996971 hartree
pointgroup: C01 [X(C13H10N2O1)]
dipole: -0.5990649 1.6253533 0.0419079 debye
dipolederiv: -1.2547627 -0.7243675 0.0795063 -1.0594043 -1.0027133 0.0875 0.0783135 0.0588838 -0.3052328 -0.4233318 0.0038869 0.0181159 0.1363943 -0.4095956 -0.0093617 0.017325 0.0004681 -0.1923414 -0.5413798 -0.2377612 0.0237748 -0.0570837 -0.3240328 0.0048948 0.0221152 0.0184367 -0.2535565 0.3251646 -0.254898 -0.0181522 0.1469638 -0.2395112 -0.0097755 -0.0201051 0.0215283 0.0762137 -0.2471557 0.115223 0.019744 -0.3811864 -0.3098188 0.0316021 0.0222393 -0.0071391 0.0159001 0.1142214 0.0621138 -0.0086657 -0.6638411 0.152898 0.0510749 -0.0058669 -0.0061866 0.0071299 0.5759647 0.2773219 -0.0410008 0.6030727 0.3100819 -0.0482528 -0.0425411 -0.0225334 0.0665576 0.822386 0.8323999 -0.059352 1.1198865 0.9159016 -0.0926064 -0.0595151 -0.0681287 0.1158453 -0.6396685 -0.4968704 0.0372381 -0.1450364 -0.0755046 0.010855 0.0361434 0.0385375 -0.202907 0.0845739 0.0550093 -0.0159756 -0.0131731 0.1385378 -0.000216 -0.0154747 -0.0056781 -0.1146545 0.3759008 -0.0275058 -0.0378357 0.1629983 0.1538927 -0.0144057 -0.0386662 0.0004492 -0.1101889 -0.2713161 -0.0190795 0.0115114 -0.0755214 0.0387126 0.0052317 0.01189 0.0007559 -0.1254284 -0.4012943 0.1346102 0.0194861 0.3129068 -0.1815734 -0.0241996 0.0180162 -0.0100154 -0.1414055 0.382673 -0.0539836 -0.035482 0.0355314 0.1610634 -0.0038234 -0.0359131 0.0032567 -0.0714326 0.3792268 0.0438964 -0.0339503 -0.2886911 0.3649893 0.0198057 -0.0317577 -0.0060528 -0.0574655 0.8781216 0.3938196 -0.050761 0.1553635 0.3678009 -0.0129377 -0.049101 -0.0317924 0.283674 0.0982634 0.0394308 0.0052246 -0.0113616 0.0035559 0.0018075 0.0053742 -0.0020872 0.1687349 0.0264599 -0.1282344 0.0090351 -0.0639014 0.0002089 0.0056656 0.0086646 0.0106991 0.1328429 0.0982142 0.0795996 0.0022154 0.0116862 -0.087874 0.0005039 0.0027004 -0.0048453 0.1332352 0.0620543 0.0621661 0.0076632 0.0887195 -0.0910763 -0.0056912 0.0074671 -0.003645 0.163278 -0.0407923 -0.0922424 0.0167525 -0.1222509 -0.0011006 0.0105582 0.0167848 0.0082644 0.1663032 -0.1311864 0.0741216 0.020186 0.0430867 0.0637982 -0.0030529 0.0204599 -0.005495 0.1302379 -0.1584954 0.0341226 0.0219012 0.0528677 0.0784438 -0.0037378 0.0219263 -0.0023619 0.126402 -0.0575189 -0.0646057 0.034085 0.0695912 0.0851309 -0.0988696 0.0712101 -0.0625677 -0.0727798 0.01752 -0.055274 0.0083809 -0.1423527 -0.1996653 0.0125884 0.0089405 0.0058224 0.116373 -0.0738425 -0.0528991 -0.0336451 0.0847355 0.0874501 0.0848428 -0.0706301 0.0714265 -0.0553348 unknown
polarizability: 259.8717249|2.4704803|181.3997672|-15.2745289|-0.8438529|65.511405 unknown
InChI: InChI=1S/C13H10N2O/c1-16-12-8-11-9(4-2-6-14-11)10-5-3-7-15-13(10)12/h2-8H,1H3
charge 0 multiplicity 1
26 atoms
O  -1.507446 -2.698118 0.273562
N  -2.509701 0.090878 0.337999
N  2.97289 -1.218683 -0.080425
C  -0.167345 0.884291 0.150991
C  1.248984 0.571347 0.042203
C  -1.155865 -0.173709 0.233672
C  1.644936 -0.816822 0.01938
C  -0.704742 -1.567172 0.205339
C  0.65688 -1.847432 0.10118
C  -0.659261 2.225465 0.182904
C  2.284716 1.548633 -0.044314
C  -2.030276 2.480375 0.289062
C  3.621007 1.141594 -0.145344
C  -2.922227 1.374132 0.364128
C  3.913731 -0.255171 -0.158783
C  -2.977209 -2.690975 0.395497
H  0.991882 -2.886988 0.081037
H  0.040291 3.064752 0.123968
H  2.048153 2.617497 -0.032655
H  -2.419112 3.502616 0.314657
H  4.433518 1.871169 -0.212987
H  -4.003626 1.534378 0.4481
H  4.951737 -0.601299 -0.236559
H  -3.299838 -2.185824 1.319079
H  -3.234301 -3.76237 0.419464
H  -3.448175 -2.190163 -0.464555
