program: Gaussian 09
title: 000285325
version: EM64L-G09RevD.01
frameworkgroup: C1[X(C10H11NOS)]
method: RPBEPBE
basis: SDD
operation: Freq
keyword: #p
keyword: freq=noraman
keyword: PBEPBE/SDD
title: #p freq=noraman PBEPBE/SDD
converged: NO YES NO NO
title: Mulliken charges:
elementType: S O N C C C C C C C C C C H H H H H H H H H H H
charge: 0.190549 -0.263944 -0.014309 -0.346935 0.319094 0.346246 -0.401102 -0.316539 -0.365996 -0.096132 -0.243641 -0.733294 -0.685142 0.262428 0.257998 0.254749 0.209798 0.209762 0.241369 0.241361 0.259111 0.208307 0.233147 0.233115
chargesum: 0.00000
title: Mulliken charges with hydrogens summed into heavy atoms:
elementType: S O N C C C C C C C C C C
charge: 0.190549 -0.263944 -0.014309 -0.346935 0.319094 0.346246 -0.138674 -0.058542 -0.111247 -0.096132 0.175919 0.008547 -0.010573
polarizability: 2.19436277e+02 7.43465444e+00 1.36032305e+02 -1.38164981e-03 7.53404091e-04 6.63847727e+01
1716.lowfreq: -4.9462 -0.0017 -0.0013 0.0011 3.0188 8.1673 51.0708 79.9882 110.2129
frequency: 51.0637 79.9502 110.2117 111.9548 114.9695 191.8969 222.5933 234.9699 245.5171 283.1809 355.3543 364.1275 419.8626 436.9494 481.8192 506.4509 530.5512 550.5765 607.3094 608.9195 680.1003 737.1440 786.9716 818.7601 829.1655 847.5763 855.3856 920.5513 960.3928 984.3806 1024.7531 1035.4348 1038.7961 1113.4931 1118.9541 1131.2459 1136.3527 1201.9968 1253.5376 1263.4594 1270.2509 1358.5098 1375.5235 1393.0046 1401.8664 1420.7933 1452.1868 1455.0916 1457.2469 1461.8826 1479.2251 1491.4871 1555.7610 1574.2304 1615.8435 2953.9104 2988.8515 2998.3407 3012.1873 3069.0092 3095.3092 3108.1417 3114.6746 3159.0375 3173.3781 3179.8751
redmass: 3.8214 1.0918 2.9995 1.9154 3.7339 4.7702 4.1329 3.4624 1.2731 3.8742 5.4093 5.3849 5.5102 2.9979 5.6472 6.4351 7.2344 4.7267 3.3720 6.4833 6.6640 4.0525 5.3107 1.2627 1.4127 1.3449 4.4921 4.0231 1.3390 2.3059 2.5151 1.4163 3.1054 1.5219 1.8750 2.5072 1.4345 2.7228 5.3903 1.1425 1.4254 1.8710 2.1511 1.2658 1.2909 4.8128 2.8331 1.0446 1.1000 1.0400 1.0684 1.1100 7.5927 7.2529 7.2067 1.0552 1.0368 1.0363 1.1075 1.0978 1.0988 1.1014 1.0990 1.0881 1.0916 1.0976
irintensity: 1.1957 0.4481 0.6889 1.6121 0.9820 4.6918 2.6336 3.3204 2.3311 1.4441 0.6251 0.0234 1.5504 6.4574 8.4214 8.7570 0.2884 21.0049 5.7600 11.0130 1.5829 0.4497 22.8576 3.5435 62.2228 18.0768 9.8651 70.5687 0.1037 8.0670 2.1482 2.6666 89.9614 9.4823 14.6075 22.9025 4.7007 206.6622 97.6491 0.0093 0.3301 23.8835 2.6072 25.6733 27.1450 8.9082 139.6904 20.3631 21.5046 12.0510 7.7258 4.0702 6.7637 52.5477 143.3167 32.1853 22.5616 26.3248 36.4439 13.0838 26.5957 33.6779 6.2044 2.4105 6.1448 6.8738
temp: 298.150 k
press: 1.00000 atm
elementType: 16 8 7 6 6 6 6 6 6 6 6 6 6 1 1 1 1 1 1 1 1 1 1 1
symmnumber: 1
zpe: 489645.3 jmol-1
zpe.correction: 0.186496 hartree
zpe.thermalcorrener: 0.199072 hartree
zpe.thermalcorrenthalpy: 0.200016 hartree
zpe.thermalcorrgfe: 0.147228 hartree
zpe.sumelectzpe: -914.752440 hartree
zpe.sumelectthermal: -914.739865 hartree
zpe.sumelectthermalent: -914.738921 hartree
zpe.sumelectthermalfe: -914.791709 hartree
dipole: 1.0645 -2.1367 0.0006
dipole: 2.3872
quadrupole: -68.6575 -81.4232 -86.9372
quadrupole: -2.0028 -0.0003 0.0012
quadrupole: 10.3484 -2.4172 -7.9312 -2.0028 -0.0003 0.0012
hfenergy: -914.9389365 hartree
pointgroup: C01 [X(C10H11N1O1S1)]
dipole: 0.4457897 0.8266694 -0.0012828 debye
dipolederiv: -0.5132037 -0.1228931 0.0137989 -0.0638749 -0.4220054 -0.0046271 0.0145851 -0.0029995 0.0455266 -2.0324254 -0.3273456 0.0440278 -0.5118796 -0.4429172 0.0119474 0.0415432 0.0068688 -0.2825121 -0.2907923 0.1060596 0.0046626 -0.0405571 -0.8030683 -0.0074875 0.0026223 -0.0114246 -0.1766523 0.4689331 -0.1847783 -0.0176911 -0.3678029 0.172716 0.0135951 -0.0202499 0.0084379 -0.079009 -0.027074 -0.0858785 0.0005439 0.0872834 -0.1030662 -0.0043106 0.0030286 0.0004619 0.035599 1.7414908 0.2302315 -0.0424262 0.0600973 0.1817087 -0.0005203 -0.0446856 -0.005212 0.0997339 -0.5285861 0.0247179 0.0098417 0.4016216 -0.0820645 -0.0097401 0.0150316 0.0007373 -0.1847247 0.3246582 -0.0681978 -0.0134559 -0.0554741 0.1433135 0.0053039 -0.01329 0.0057137 -0.1267697 -0.446883 -0.0496215 0.0063099 -0.386814 -0.0225612 0.0130994 0.0017 0.0037539 -0.1933463 0.6263139 0.2202604 -0.0165125 0.4124105 0.9139624 0.0021971 -0.01417 0.007549 -0.0787221 0.7665188 0.2038732 -0.0073192 0.7356722 0.5101817 -0.0188794 -0.0002139 -0.0041235 0.3987893 -0.2124176 0.0342069 0.0084944 0.0255472 -0.0323582 -0.0022123 0.0085818 -0.0025149 0.076338 -0.1491152 -0.0082269 0.0053929 -0.0573237 0.0617901 0.0018341 0.0045946 0.0004015 0.0540325 0.0708516 -0.0363521 0.0023134 -0.0942507 -0.0174306 0.000024 0.0015222 -0.001582 0.17178 0.0607847 -0.0738499 0.0018457 -0.0332948 -0.0349548 -0.0018361 0.0024067 -0.000767 0.1642166 0.0273821 0.0919529 0.0052743 0.0818141 0.0109072 -0.0044951 0.0051367 -0.0047898 0.171086 -0.0240001 0.0525267 -0.0866577 -0.1035828 -0.0570252 0.0810024 -0.0463639 0.1025633 -0.0824678 -0.0168865 0.0444289 0.0841953 -0.1090122 -0.0521407 -0.0742109 0.039695 -0.1043309 -0.094532 0.0148235 0.0156614 0.0100331 0.0451163 0.0549127 -0.1038078 0.0800353 -0.0947424 -0.0294482 0.0098339 0.0212373 -0.0115726 0.0530732 0.049445 0.1032013 -0.080749 0.0958304 -0.0189048 0.0074299 -0.0400815 0.0029378 -0.1204262 -0.0259932 0.0011363 0.0018451 -0.0010722 0.1336643 -0.020987 -0.0836461 0.0025435 -0.1391158 -0.1000705 0.0006168 0.0017688 -0.0008956 0.1147271 0.0691703 0.0208613 -0.0339201 0.0941223 0.0454999 0.0998195 -0.0686466 0.0950881 -0.0536372 0.07418 0.0148533 0.02734 0.0866506 0.051219 -0.1016501 0.0642719 -0.0929515 -0.0647673 unknown
polarizability: 218.7469075|-10.0708038|136.5838808|-4.3599493|1.2400357|66.5225658 unknown
InChI: InChI=1S/C10H11NOS/c1-3-12-8-4-5-9-10(6-8)13-7(2)11-9/h4-6H,3H2,1-2H3
charge 0 multiplicity 1
24 atoms
S  -2.009587 1.808043 -0.016053
O  2.924049 -0.329342 -0.182096
N  -2.684287 -0.804345 -0.033021
C  -0.702601 0.556611 -0.06917
C  -1.274945 -0.755489 -0.071327
C  1.523688 -0.378326 -0.143882
C  0.689926 0.767315 -0.105014
C  -0.41716 -1.882507 -0.11065
C  0.971051 -1.692621 -0.146649
C  -3.236384 0.385741 -0.001666
C  3.570357 0.998993 -0.181992
C  -4.704026 0.684193 0.043113
C  5.076584 0.758386 -0.226849
H  1.104205 1.777982 -0.102721
H  -0.853119 -2.885539 -0.11253
H  1.660866 -2.540724 -0.177619
H  3.226954 1.57438 -1.06656
H  3.276863 1.550046 0.735456
H  -4.971754 1.256158 0.950302
H  -5.021238 1.280724 -0.831731
H  -5.260566 -0.266453 0.045478
H  5.61426 1.723997 -0.227204
H  5.404057 0.175431 0.650551
H  5.355309 0.201944 -1.137664
