program: Gaussian 09
title: 000285363
version: EM64L-G09RevD.01
frameworkgroup: C1[X(C15H13F3N2O2)]
method: RPBEPBE
basis: SDD
operation: Freq
keyword: #p
keyword: freq=noraman
keyword: PBEPBE/SDD
title: #p freq=noraman PBEPBE/SDD
converged: YES YES NO NO
title: Mulliken charges:
elementType: F F F O O N N C C C C C C C C C C C C C C C H H H H H H H H H H H H H
charge: -0.177805 -0.136311 -0.139135 -0.324798 -0.202201 -0.357285 -0.364796 0.231418 -0.434298 0.277365 0.480273 -0.323760 -0.333276 -0.445498 -0.384426 -0.248200 -0.225447 -0.222069 -0.230059 -0.237082 0.170129 0.333556 0.218969 0.227378 0.246261 0.232547 0.351365 0.231968 0.278299 0.227980 0.227291 0.228209 0.236322 0.230559 0.356558
chargesum: 0.00000
title: Mulliken charges with hydrogens summed into heavy atoms:
elementType: F F F O O N N C C C C C C C C C C C C C C C
charge: -0.177805 -0.136311 -0.139135 -0.324798 -0.202201 -0.005920 -0.008239 0.231418 0.012049 0.277365 0.480273 -0.077500 -0.100729 -0.213531 -0.106126 -0.020220 0.001843 0.006141 0.006263 -0.006523 0.170129 0.333556
polarizability: 2.19972470e+02 1.77973674e+01 2.26048343e+02 5.86878492e+00 1.11496742e+01 1.06715957e+02
1716.lowfreq: 0.0011 0.0011 0.0011 0.4653 4.6289 6.3309 18.7306 20.8392 30.2310
frequency: 18.7108 20.6264 30.1912 39.5752 41.8629 53.3636 54.9390 101.0795 136.7252 158.9283 181.3222 197.3849 241.0792 263.7845 280.3455 284.2213 299.3488 341.4728 374.5586 400.0111 406.0827 441.4590 451.9660 471.2416 507.1365 518.5911 534.7824 554.8085 582.1960 594.6182 610.3285 617.3086 640.1747 681.1159 706.8151 714.0815 727.5527 742.1678 752.6420 788.7628 822.6285 827.3979 836.7522 857.3991 862.5999 910.0515 923.8112 952.8353 961.1947 985.5673 989.1806 996.2725 1009.0297 1010.8411 1026.7227 1036.6649 1038.2610 1048.4382 1091.2078 1096.8585 1167.5484 1170.7058 1173.6789 1190.0219 1193.5610 1200.8759 1226.8714 1243.0188 1276.2633 1296.3199 1325.5685 1354.9534 1385.3790 1391.5878 1438.0830 1442.2108 1461.1684 1474.4520 1485.5722 1490.0175 1499.3601 1596.0521 1606.5019 1610.7329 1616.4242 1649.6358 2965.7070 3031.2648 3118.5731 3127.0937 3134.7283 3136.2894 3144.2448 3149.4709 3156.2294 3165.1083 3172.2931 3445.9046 3531.4694
redmass: 7.7721 12.3789 4.9973 5.9302 6.5523 7.5901 5.5002 3.7798 6.5910 5.3499 7.1924 7.6403 6.3676 5.4327 5.1395 6.0702 5.1233 3.5215 15.3794 4.3764 2.8438 11.9629 3.5086 4.7488 7.3134 5.2513 3.9913 4.9647 3.3697 1.2797 5.6987 5.8146 11.3388 2.5397 2.0905 5.8870 4.3310 1.2895 1.5943 4.6075 4.2027 3.3224 1.5706 4.7237 1.2817 1.3868 1.4117 6.5810 1.3058 1.4042 5.1118 1.6522 1.5356 7.5367 2.1860 3.2250 3.8525 6.5634 1.6093 2.5514 2.3862 1.0786 1.0548 1.4470 1.4385 1.6285 2.1576 2.9488 2.1306 2.0799 1.3187 1.4441 6.1078 4.3712 2.1913 2.1905 1.6791 1.2299 2.1593 1.8262 1.8094 6.0420 6.9170 5.4200 6.0318 10.1896 1.0571 1.1060 1.0871 1.0873 1.0850 1.0920 1.0892 1.0962 1.0944 1.1016 1.1007 1.0760 1.0794
irintensity: 0.7928 0.6554 0.9049 0.2348 2.3696 0.2300 0.7407 3.9341 1.5662 4.2926 0.0365 5.3274 1.7731 8.5110 4.9154 1.8190 0.4349 3.2508 2.8656 13.0988 0.9716 6.6931 7.1075 14.3869 7.6727 8.2193 14.8705 4.1201 49.5513 80.6904 0.6572 0.8688 19.4556 108.3541 44.2009 1.9234 8.0567 56.8395 107.1397 7.2734 16.5949 7.4606 2.8067 24.6354 1.1652 2.8223 21.6793 113.1097 0.7018 0.5110 0.1636 0.6765 10.6353 198.9468 3.8093 170.0294 88.7630 112.3811 28.1230 105.5618 42.8765 8.8889 0.0458 31.9858 21.0957 60.4359 2.5973 129.3090 33.6309 40.4968 2.6367 20.4475 4.7023 2.7709 65.8045 0.7978 26.8777 59.9480 17.7575 58.7221 78.7832 0.2668 34.2615 11.8093 1.7166 204.2691 30.0044 26.8488 6.4900 0.5820 1.3776 12.8173 11.7115 26.2601 27.8484 25.9216 15.2775 64.3437 62.1849
temp: 298.150 k
press: 1.00000 atm
elementType: 9 9 9 8 8 7 7 6 6 6 6 6 6 6 6 6 6 6 6 6 6 6 1 1 1 1 1 1 1 1 1 1 1 1 1
symmnumber: 1
zpe: 670459.2 jmol-1
zpe.correction: 0.255364 hartree
zpe.thermalcorrener: 0.275233 hartree
zpe.thermalcorrenthalpy: 0.276177 hartree
zpe.thermalcorrgfe: 0.202897 hartree
zpe.sumelectzpe: -1137.252191 hartree
zpe.sumelectthermal: -1137.232322 hartree
zpe.sumelectthermalent: -1137.231378 hartree
zpe.sumelectthermalfe: -1137.304658 hartree
dipole: -1.8060 2.2068 -1.1366
dipole: 3.0697
quadrupole: -113.6353 -120.3573 -131.5650
quadrupole: 5.4379 -4.7077 6.5041
quadrupole: 8.2172 1.4952 -9.7124 5.4379 -4.7077 6.5041
hfenergy: -1137.5075551 hartree
pointgroup: C01 [X(C15H13F3N2O2)]
dipole: -0.6715708 -0.9039369 0.4364578 debye
polarizability: 221.4315921|-17.8454189|224.1884965|-7.0435745|12.6981806|107.1166822 unknown
InChI: InChI=1S/C15H13F3N2O2/c16-15(17,18)14(21)20-19-12-8-4-5-9-13(12)22-10-11-6-2-1-3-7-11/h1-9,19-20H,10H2
charge 0 multiplicity 1
35 atoms
F  4.474207 1.67053 0.837925
F  4.096826 1.955519 -1.385681
F  3.26713 3.45139 0.101545
O  -1.350405 -1.221409 0.549893
O  1.219698 1.506654 -0.793149
N  1.090891 -0.505132 1.213949
N  2.215255 0.300325 0.960457
C  -0.359634 -2.148273 0.17162
C  -2.625973 -1.212376 -0.209916
C  0.965116 -1.738776 0.506385
C  -3.216375 0.178307 -0.118168
C  -0.587932 -3.371652 -0.48697
C  2.05468 -2.566427 0.163961
C  -4.548127 0.365249 0.323246
C  -2.444418 1.305496 -0.504494
C  0.512457 -4.197101 -0.825491
C  1.826335 -3.792241 -0.505568
C  -5.111886 1.661351 0.370634
C  -3.004777 2.599738 -0.447465
C  -4.340492 2.781107 -0.014212
C  2.188365 1.258153 -0.032253
C  3.500932 2.085188 -0.123282
H  -3.310626 -1.969815 0.217614
H  -2.398555 -1.484181 -1.261083
H  -1.606593 -3.686163 -0.735345
H  3.075768 -2.251494 0.403827
H  0.209182 0.0245 1.261579
H  -5.145526 -0.500886 0.634201
H  -1.407449 1.173137 -0.836407
H  0.337222 -5.148888 -1.337253
H  2.677387 -4.427034 -0.773047
H  -6.144086 1.796301 0.712435
H  -2.401616 3.464697 -0.744536
H  -4.774025 3.786749 0.025303
H  3.012845 0.21386 1.594849
