program: Gaussian 09
title: 000285310
version: EM64L-G09RevD.01
frameworkgroup: C1[X(C7H4F2O6S2)]
method: RPBEPBE
basis: SDD
operation: Freq
keyword: #p
keyword: freq=noraman
keyword: PBEPBE/SDD
title: #p freq=noraman PBEPBE/SDD
converged: NO YES NO NO
title: Mulliken charges:
elementType: S S F F O O O O O O C C C C C C C H H H H
charge: 1.099429 1.097655 -0.325846 -0.326307 -0.451578 -0.453624 -0.452855 -0.454757 -0.429197 -0.211022 -0.067407 -0.068559 -0.212700 0.297028 -0.313418 -0.280593 0.144012 0.338073 0.330162 0.333656 0.407847
chargesum: 0.00000
title: Mulliken charges with hydrogens summed into heavy atoms:
elementType: S S F F O O O O O O C C C C C C C
charge: 1.099429 1.097655 -0.325846 -0.326307 -0.451578 -0.453624 -0.452855 -0.454757 -0.021350 -0.211022 -0.067407 -0.068559 0.125373 0.297028 0.016744 0.053063 0.144012
polarizability: 1.86865786e+02 -1.06187736e+00 1.79912785e+02 1.59481670e-01 4.10718506e+00 8.27245044e+01
1716.lowfreq: -7.0112 -4.2750 0.0006 0.0010 0.0024 3.3894 15.2747 20.5826 56.5136
frequency: 15.1400 20.5300 56.5127 65.5923 79.2158 96.7792 109.9191 155.8159 171.7163 176.4886 216.4044 221.6243 224.6024 245.0424 250.8223 297.3345 312.7544 316.6109 379.0336 386.6706 434.0646 436.4013 464.8888 513.7029 522.1771 562.1098 570.7679 599.9485 611.8097 661.2117 704.4204 734.2003 793.3306 858.4223 861.0156 917.2611 958.0883 966.0822 970.0896 1002.0526 1002.6601 1031.8385 1081.4049 1088.6709 1146.2783 1243.0173 1318.5382 1382.6970 1407.0004 1438.0057 1558.8927 1600.8770 1652.2180 3146.4888 3155.1719 3172.9203 3538.8522
redmass: 17.0054 16.0378 11.1075 12.6494 14.6100 11.4341 12.1400 7.0094 12.4969 11.1210 12.5630 6.2114 8.1655 8.4119 12.6226 16.4254 11.7936 14.3246 9.7237 9.2240 15.6684 11.0860 4.0450 7.4051 5.8005 12.8820 13.3473 4.7971 1.3737 2.7167 10.3679 4.6388 8.5345 18.3775 17.4666 1.4079 1.4560 1.4208 5.8800 15.9891 16.0320 3.8172 1.6547 1.8116 2.0226 1.2024 2.4161 4.2953 4.4932 3.7949 7.8607 7.7239 10.0101 1.0939 1.0936 1.0937 1.0647
irintensity: 0.0466 0.2867 1.2924 3.8890 4.5109 0.4034 1.7528 1.2457 1.9294 2.4731 3.0373 4.5102 0.3076 0.2002 13.5811 12.3601 0.2205 10.7036 54.1130 16.8769 43.2052 91.1112 11.3637 34.1145 3.2011 136.3040 27.4867 37.7561 234.0790 0.5284 6.0809 41.7984 7.6710 75.1245 90.0945 18.9073 9.6070 6.8629 6.5877 55.7556 76.6130 284.2803 19.3608 1.0274 79.7571 2.1577 128.5501 15.6474 14.0726 8.2165 15.4922 2.5197 204.4999 30.5717 16.8759 17.0626 84.5603
temp: 298.150 k
press: 1.00000 atm
elementType: 16 16 9 9 8 8 8 8 8 8 6 6 6 6 6 6 6 1 1 1 1
symmnumber: 1
zpe: 286542.6 jmol-1
zpe.correction: 0.109138 hartree
zpe.thermalcorrener: 0.126776 hartree
zpe.thermalcorrenthalpy: 0.127720 hartree
zpe.thermalcorrgfe: 0.060622 hartree
zpe.sumelectzpe: -1714.693945 hartree
zpe.sumelectthermal: -1714.676307 hartree
zpe.sumelectthermalent: -1714.675362 hartree
zpe.sumelectthermalfe: -1714.742461 hartree
dipole: 1.5626 5.2297 -1.1156
dipole: 5.5710
quadrupole: -141.5033 -109.7424 -117.3034
quadrupole: 9.8497 0.1768 0.8481
quadrupole: -18.6536 13.1073 5.5463 9.8497 0.1768 0.8481
hfenergy: -1714.8030828 hartree
pointgroup: C01 [X(C7H4F2O6S2)]
dipole: -0.6482813 -2.0518205 -0.416805 debye
dipolederiv: 1.8612205 0.348975 -0.0000417 0.4073066 1.2914308 0.0099956 0.0156497 0.0151438 1.5815927 1.7882114 -0.3858239 0.0003863 -0.4482187 1.3580554 0.0098231 -0.0153012 0.0173647 1.5803774 -0.4846211 -0.0866617 -0.0370669 -0.0980173 -0.3410288 -0.015942 -0.2158948 -0.0976779 -0.8486891 -0.4701392 0.1000195 0.0385555 0.1092057 -0.3592901 -0.0183368 0.2128934 -0.1244597 -0.8491614 -0.6728132 -0.0592611 0.0434409 -0.0140064 -0.4735576 -0.0545553 0.0666781 -0.0045118 -0.4043068 -0.5833576 -0.0598211 -0.0154167 -0.1304251 -0.5455139 0.0627003 0.0361044 0.0433769 -0.4021533 -0.5663431 0.0637903 0.0201115 0.1364269 -0.5719528 0.0616467 -0.0352102 0.0527918 -0.4014168 -0.6723803 0.0765129 -0.049836 0.0271932 -0.4870462 -0.0517441 -0.0689895 0.0030916 -0.4070045 -0.9604817 -0.5334079 0.0235955 -0.4387368 -0.6956203 0.0128303 0.0204563 0.0142579 -0.4072141 -0.7143849 0.0827413 -0.0015827 0.256684 -0.9189848 0.0230237 -0.0077195 0.023992 -0.2992395 0.0108132 0.1679999 -0.001058 0.0841688 -0.114258 -0.0011164 0.1272576 0.0590385 -0.1317477 -0.0060939 -0.1874433 0.0015759 -0.0884683 -0.098357 -0.0012583 -0.1205647 0.0683822 -0.1325097 -0.133453 -0.0104553 0.0004798 -0.0051737 -0.2561483 0.0154566 -0.0007251 -0.0168546 -0.0055538 -0.0854794 -0.0247843 0.000993 -0.0480633 -0.4286615 0.0194604 0.0018174 0.0103596 0.0389803 -0.1744069 -0.0699465 0.0016447 0.0671648 0.0103786 -0.0117705 -0.025714 -0.0034259 -0.0202012 -0.1952522 0.1240156 -0.0042806 -0.0544978 0.0370109 -0.0125315 0.0244167 -0.0060876 -0.0207801 1.2630789 0.3104938 -0.0163 0.1187735 1.8126988 -0.0615177 -0.0089762 -0.0612024 0.248644 0.2129315 -0.0009635 0.0003666 -0.0020118 0.1584304 0.0056567 0.0005942 0.0153967 0.1540686 0.1363879 0.0174587 0.0034766 0.028742 0.1940421 0.0002443 0.0079255 -0.0076732 0.1557289 0.1317461 -0.0268495 -0.0028805 -0.0009218 0.1984192 0.0007044 -0.0103521 -0.0069716 0.1579964 0.3148171 0.153411 -0.006163 0.0928753 0.2299529 0.0072306 -0.004346 0.0056691 0.4125898 unknown
polarizability: 186.8292591|-1.1768556|179.8493|-0.2045256|-5.1537853|82.824517 unknown
InChI: InChI=1S/C7H4F2O6S2/c8-16(12,13)5-1-4(7(10)11)2-6(3-5)17(9,14)15/h1-3,10H
charge 0 multiplicity 1
21 atoms
S  2.880087 1.246664 -0.153177
S  -2.741209 1.504246 -0.157509
F  3.109073 1.356638 1.676069
F  -2.966751 1.634276 1.671226
O  4.00783 0.244472 -0.694796
O  2.69365 2.746907 -0.688064
O  -2.42281 2.981912 -0.692649
O  -3.952744 0.605508 -0.701186
O  -1.38915 -3.657359 0.072323
O  0.931632 -3.883343 0.072716
C  1.207594 0.380678 -0.093022
C  -1.154352 0.489877 -0.094172
C  0.061218 1.190652 -0.123265
C  -0.071713 -1.665469 -0.010651
C  1.188637 -1.017916 -0.035382
C  -1.267212 -0.905532 -0.035938
C  -0.088342 -3.162711 0.049011
H  0.112052 2.284387 -0.182449
H  2.107336 -1.615484 -0.020839
H  -2.239995 -1.406332 -0.022563
H  -1.382831 -4.650969 0.113418
