program: Gaussian 09
title: 000285292
version: EM64L-G09RevD.01
frameworkgroup: C1[X(C8H5Cl2NS)]
method: RPBEPBE
basis: SDD
operation: Freq
keyword: #p
keyword: freq=noraman
keyword: PBEPBE/SDD
title: #p freq=noraman PBEPBE/SDD
converged: NO YES NO NO
title: Mulliken charges:
elementType: Cl Cl S N C C C C C C C C H H H H H
charge: -0.003268 -0.039227 0.234739 0.013003 0.507285 -0.344574 -0.087929 -0.252464 -0.287513 -0.229802 -0.100392 -0.727185 0.275409 0.283041 0.246425 0.246460 0.265992
chargesum: 0.00000
title: Mulliken charges with hydrogens summed into heavy atoms:
elementType: Cl Cl S N C C C C C C C C
charge: -0.003268 -0.039227 0.234739 0.013003 0.507285 -0.344574 -0.087929 -0.252464 -0.012104 0.053239 -0.100392 0.031692
polarizability: 1.96571410e+02 7.80237745e-01 1.45477157e+02 -1.00907639e-02 3.52209731e-03 5.07515554e+01
1716.lowfreq: -0.0034 -0.0020 -0.0017 5.5646 6.0425 7.9874 77.2511 92.0473 127.9622
frequency: 77.2472 92.0396 127.9613 157.6747 174.0814 188.6624 213.9323 286.9266 331.4825 354.1647 382.3603 409.1730 515.4695 517.5610 518.0938 536.6022 581.2769 588.3741 720.1655 745.1231 783.4839 841.7375 855.7564 861.2012 985.2945 1036.2194 1060.3300 1099.3045 1137.7897 1184.9722 1246.7680 1338.1285 1390.8573 1394.0731 1421.6111 1454.2719 1454.8186 1540.7038 1557.1695 1596.3271 2992.3203 3073.1269 3121.3340 3182.3115 3184.2728
redmass: 4.4359 1.1214 13.0280 7.4512 16.0162 4.7101 4.5588 4.8787 13.2206 5.6929 10.9655 8.0192 5.6239 6.0080 6.7301 6.2215 3.9923 6.0186 11.3630 7.9984 10.8626 6.3601 1.4152 1.3634 2.3379 1.4285 2.3972 3.9124 3.0247 1.7019 3.2644 3.1892 2.6989 1.6464 4.4614 1.0905 1.0441 8.0682 7.4883 9.1767 1.0370 1.0977 1.0991 1.0932 1.0936
irintensity: 0.5319 0.5883 0.6775 1.3867 0.1617 4.2152 0.1871 2.3491 2.4846 0.1879 5.0703 2.3003 0.0002 0.6253 15.3223 1.3127 8.1152 32.0599 63.6347 8.4042 45.8132 10.9228 45.6440 0.0820 7.6173 2.8505 22.8685 34.2874 59.9671 5.4774 6.9818 15.0633 29.6050 46.4783 31.5164 23.9212 21.8222 67.0638 35.7957 108.1669 10.7205 9.4088 3.7986 1.1182 0.5257
temp: 298.150 k
press: 1.00000 atm
elementType: 17 17 16 7 6 6 6 6 6 6 6 6 1 1 1 1 1
symmnumber: 1
zpe: 282991.9 jmol-1
zpe.correction: 0.107786 hartree
zpe.thermalcorrener: 0.118865 hartree
zpe.thermalcorrenthalpy: 0.119809 hartree
zpe.thermalcorrgfe: 0.069805 hartree
zpe.sumelectzpe: -1679.944829 hartree
zpe.sumelectthermal: -1679.933750 hartree
zpe.sumelectthermalent: -1679.932806 hartree
zpe.sumelectthermalfe: -1679.982810 hartree
dipole: -2.0551 -1.8544 0.0002
dipole: 2.7681
quadrupole: -80.4430 -91.7432 -92.2128
quadrupole: 5.2251 -0.0008 -0.0004
quadrupole: 7.6900 -3.6102 -4.0798 5.2251 -0.0008 -0.0004
hfenergy: -1680.0526149 hartree
pointgroup: C01 [X(C8H5Cl2N1S1)]
dipole: -0.8068298 0.7314861 -0.0000721 debye
dipolederiv: -0.0909324 -0.0974825 -0.0000082 -0.0362096 -0.7559832 -0.0000337 -0.0000041 -0.0000186 -0.0297326 -0.846085 -0.1908098 -0.0000621 -0.2421518 -0.1938461 -0.0000232 -0.0000574 -0.0000206 -0.0560712 -0.4367423 -0.1178913 -0.0000055 -0.0977708 -0.4297765 -0.0000216 -0.0000314 0.0000209 0.0753156 -0.5528945 0.2345882 -0.0000098 0.1476106 -0.7360293 0.0000114 0.00001 -0.0000473 -0.1638104 0.1785846 -0.120802 -0.0000123 0.1494158 -0.3253541 -0.0000111 -0.0000574 0.0000262 0.0821298 0.4443632 -0.16799 0.0000443 -0.276876 0.0786041 0.0000043 0.0000223 -0.0000182 -0.0811901 0.6828123 0.1379203 0.000058 0.2161762 1.058408 0.0000032 0.0003355 -0.00004 -0.0627606 0.3281233 0.2106626 0.0000344 -0.0021987 1.2045773 0.0000529 0.0000441 0.0000385 -0.0528429 -0.4833708 0.0378065 -0.0000264 0.0703716 -0.088461 0.0000048 -0.0000184 -0.0000035 -0.0899112 -0.3972784 -0.2408029 -0.0000296 -0.2044038 -0.389691 -0.000027 -0.0000338 -0.000024 -0.0833882 1.2026299 0.264506 0.0000965 0.3114321 0.436879 0.000048 0.0000893 0.0000463 -0.0648026 -0.273792 0.0055597 -0.000032 -0.0029447 -0.04381 0.0000279 -0.0004804 0.0000745 0.0629091 0.0895409 -0.0006524 -0.0000064 -0.0291197 0.0192979 -0.0000097 -0.0000057 -0.0000051 0.1776396 0.0566935 0.0434482 -0.0000062 0.0406286 0.0689406 -0.0000042 -0.0000074 -0.0000052 0.1749995 0.0256968 0.009401 0.0264128 0.0232437 0.0678526 -0.0967695 0.0809545 -0.0769147 -0.0126235 0.0255262 0.0093889 -0.0264598 0.0230844 0.0681741 0.0965708 -0.0808817 0.0767572 -0.0129434 0.0471246 -0.0168504 0.0000126 -0.0902877 -0.0397824 0.0001766 0.0001217 0.0001335 0.137083 unknown
polarizability: 196.5674519|-0.900549|145.4811152|0.010099|0.0034983|50.7515554 unknown
InChI: InChI=1S/C8H5Cl2NS/c1-4-11-8-6(10)2-5(9)3-7(8)12-4/h2-3H,1H3
charge 0 multiplicity 1
17 atoms
Cl 0.3740 -3.113765 -0.000189
Cl 3.984624 1.094842 0.000249
S  -1.62481 1.940782 -0.000103
N  -1.755779 -0.756302 -0.00016
C  -0.390582 -0.423899 -0.000121
C  -0.092206 0.981985 -0.000017
C  -2.534362 0.30186 -0.000102
C  0.692857 -1.335453 -0.000114
C  1.226722 1.474863 0.000089
C  2.020643 -0.876222 0.000013
C  2.258962 0.518262 0.000111
C  -4.031776 0.291674 -0.000218
H  1.452152 2.543569 0.000151
H  2.852854 -1.584087 0.00003
H  -4.436472 0.805262 0.890725
H  -4.436274 0.803576 -0.892233
H  -4.379453 -0.753046 0.000691
