program: Gaussian 09
title: 000285281
version: EM64L-G09RevD.01
frameworkgroup: C1[X(C12H8Cl3N5)]
method: RPBEPBE
basis: SDD
operation: Freq
keyword: #p
keyword: freq=noraman
keyword: PBEPBE/SDD
title: #p freq=noraman PBEPBE/SDD
converged: NO YES NO NO
title: Mulliken charges:
elementType: Cl Cl Cl N N N N N C C C C C C C C C C C C H H H H H H H H
charge: -0.020859 -0.022828 -0.008316 -0.461883 -0.082090 -0.338145 -0.073088 -0.080485 0.354291 0.032162 0.098327 -0.355860 -0.328145 -0.055625 -0.075931 0.012998 0.242549 -0.242284 -0.144083 -0.770772 0.388124 0.269965 0.278679 0.371714 0.267830 0.240879 0.261555 0.241320
chargesum: 0.00000
title: Mulliken charges with hydrogens summed into heavy atoms:
elementType: Cl Cl Cl N N N N N C C C C C C C C C C C C
charge: -0.020859 -0.022828 -0.008316 -0.073758 -0.082090 0.033569 -0.073088 -0.080485 0.354291 0.032162 0.098327 -0.085895 -0.049466 -0.055625 -0.075931 0.012998 0.242549 0.025546 -0.144083 -0.027018
polarizability: 3.97393868e+02 6.00744989e+00 2.07254658e+02 -1.62273306e-02 -1.07552645e-02 7.54582495e+01
1716.lowfreq: -27.7762 -3.0671 -0.0035 -0.0019 0.0009 2.8219 6.0142 32.3774 36.2473
frequency: -27.7349 32.3746 36.2124 50.4916 98.5208 116.1903 144.4245 145.5440 180.7442 194.1363 212.1207 221.5222 240.3123 273.1116 296.6512 312.2035 360.4515 385.9686 391.9178 406.0722 429.3618 447.0769 517.0962 541.3428 563.3667 618.8396 628.9877 629.2700 675.1376 688.8058 710.2375 716.6811 740.0774 744.2270 769.8253 816.9910 841.7634 845.9952 854.3974 864.6685 873.9332 914.4909 918.8162 966.6571 992.2889 1030.3771 1047.3973 1081.1689 1131.2350 1169.7225 1221.6544 1226.1820 1243.5976 1280.9525 1288.0623 1322.9803 1370.9666 1394.3276 1404.4521 1408.0943 1432.2266 1449.3506 1453.8836 1464.5186 1485.4829 1507.1472 1557.3334 1567.7727 1599.0801 1639.8741 2993.7025 3073.8652 3128.3463 3173.1348 3184.3553 3200.1236 3435.2244 3547.5276
redmass: 1.0214 6.5428 13.8506 12.8843 8.1202 8.1264 14.2469 4.7022 18.5432 8.1964 5.6766 6.1739 6.9307 7.1086 9.2247 6.5855 10.2518 9.7937 8.1167 10.8422 3.0530 4.9408 5.8238 5.4437 4.5201 3.9173 7.5616 7.5405 2.7751 6.9778 2.0149 8.7087 5.8641 3.7020 3.9038 1.1898 4.0871 1.3440 1.5063 8.4519 1.4651 7.6864 7.6131 4.3217 2.1793 2.6545 1.5955 1.8828 1.8868 2.4911 1.8730 1.5482 4.4557 5.4257 4.1132 4.4925 3.9917 1.2401 4.0979 4.8243 3.4251 5.0213 1.4839 1.0453 2.4959 6.4939 7.1528 6.8515 7.4308 7.0178 1.0383 1.0970 1.0990 1.0936 1.0935 1.0948 1.0839 1.0766
irintensity: 0.6168 0.4178 0.4907 0.8354 0.2631 1.4558 0.0815 0.0758 0.3442 2.6081 1.0330 0.0002 0.7766 3.8181 4.0830 2.5451 9.0236 14.0126 6.4447 2.8562 8.3915 25.2358 7.4966 23.7192 0.1189 0.7006 0.3521 27.7332 29.0122 18.4202 81.2990 2.5379 13.2220 3.7887 3.6419 73.3969 2.3674 26.1575 37.1382 62.2966 48.4450 3.6820 40.2300 14.8456 9.8818 22.1578 8.3504 57.4354 30.4309 35.4633 4.1894 24.7327 1.1113 69.4663 130.3547 32.8637 108.8585 40.6770 128.2833 30.6390 37.6309 41.6833 95.2478 19.3944 7.6440 397.2461 758.7686 464.0038 456.2592 240.1236 8.4884 10.4204 6.8440 0.0809 0.0895 1.2052 301.1275 100.1763
temp: 298.150 k
press: 1.00000 atm
elementType: 17 17 17 7 7 7 7 7 6 6 6 6 6 6 6 6 6 6 6 6 1 1 1 1 1 1 1 1
symmnumber: 1
zpe: 490010.9 jmol-1
zpe.correction: 0.186635 hartree
zpe.thermalcorrener: 0.203267 hartree
zpe.thermalcorrenthalpy: 0.204211 hartree
zpe.thermalcorrgfe: 0.140444 hartree
zpe.sumelectzpe: -2114.651779 hartree
zpe.sumelectthermal: -2114.635147 hartree
zpe.sumelectthermalent: -2114.634203 hartree
zpe.sumelectthermalfe: -2114.697971 hartree
dipole: -8.3077 0.1887 -0.0002
dipole: 8.3098
quadrupole: -123.7537 -137.8192 -138.2082
quadrupole: 3.2597 0.0209 0.0043
quadrupole: 9.5067 -4.5589 -4.9478 3.2597 0.0209 0.0043
hfenergy: -2114.8384142 hartree
pointgroup: C01 [X(C12H8Cl3N5)]
dipole: 3.2346891 0.1144839 -0.4607086 debye
polarizability: 394.770194|19.3963009|88.8384207|-20.034232|37.0137452|196.4981613 unknown
InChI: InChI=1S/C12H8Cl3N5/c1-5-2-10(15)19-11(16-5)20-12-17-8-3-6(13)7(14)4-9(8)18-12/h2-4,17,20H,1H3
charge 0 multiplicity 1
28 atoms
Cl -5.588222 -0.735109 -1.683992
Cl -6.205283 0.202003 1.386756
Cl 2.866554 -0.636774 -3.524649
N  -0.493851 0.102955 -0.34285
N  -0.927889 0.758245 1.818666
N  1.371072 0.720722 1.12067
N  3.670412 0.790288 0.747879
N  2.142001 0.097212 -1.033547
C  -1.88599 0.037724 -0.196478
C  -2.138096 0.451208 1.160725
C  0.01158 0.534126 0.880323
C  -2.918448 -0.326751 -1.077337
C  -3.462003 0.500968 1.646525
C  -4.232242 -0.269385 -0.569883
C  -4.498457 0.13768 0.767239
C  2.421558 0.526845 0.243551
C  4.726648 0.60913 -0.094603
C  4.536635 0.165422 -1.43917
C  3.210785 -0.069605 -1.833574
C  6.106968 0.894386 0.444433
H  0.123375 -0.101217 -1.139241
H  -2.739702 -0.642365 -2.10822
H  -3.676652 0.811352 2.671615
H  1.618426 1.040899 2.060662
H  5.377014 0.018798 -2.118544
H  6.609367 1.676309 -0.153861
H  6.039073 1.231315 1.489297
H  6.741472 -0.009681 0.399406
