program: Gaussian 09
title: 000285279
version: EM64L-G09RevD.01
frameworkgroup: C1[X(C10H13FN2O)]
method: RPBEPBE
basis: SDD
operation: Freq
keyword: #p
keyword: freq=noraman
keyword: PBEPBE/SDD
title: #p freq=noraman PBEPBE/SDD
converged: YES YES NO NO
title: Mulliken charges:
elementType: F O N N C C C C C C C C C C H H H H H H H H H H H H H
charge: -0.212358 -0.298093 -0.429410 -0.496134 -0.013161 -0.666192 -0.708220 0.288725 0.487588 -0.422075 -0.307562 -0.345519 -0.364306 0.312167 0.248106 0.280255 0.211082 0.194404 0.255912 0.233672 0.226592 0.198813 0.286927 0.219616 0.313891 0.252616 0.252664
chargesum: 0.00000
title: Mulliken charges with hydrogens summed into heavy atoms:
elementType: F O N N C C C C C C C C C C
charge: -0.212358 -0.298093 -0.149154 -0.209207 0.234945 -0.004795 -0.049144 0.288725 0.487588 -0.202458 0.006330 -0.092903 -0.111642 0.312167
polarizability: 2.00418178e+02 1.59480389e+00 1.21396793e+02 -1.45228039e+00 6.99208268e+00 7.03803415e+01
1716.lowfreq: -8.6379 0.0010 0.0010 0.0010 3.9455 10.7436 35.4585 42.6473 67.8007
frequency: 33.6914 42.0849 67.7930 81.3886 97.9014 162.9599 201.1206 214.9930 235.6171 254.2578 306.5839 320.4548 360.9395 377.4515 399.4847 413.5801 420.7674 457.8561 511.8464 525.0921 570.9640 624.8313 703.2398 708.2188 724.1774 762.8992 801.6464 819.4027 841.2593 866.7156 919.1552 921.1427 931.7554 950.6080 973.6949 999.4339 1033.0560 1109.8291 1141.6917 1147.1264 1156.0048 1181.5284 1193.8858 1217.3634 1270.4068 1293.4020 1310.6500 1350.8165 1370.5269 1377.0021 1395.7284 1409.2484 1458.9780 1465.9256 1469.3449 1484.6696 1486.4433 1497.5553 1509.9354 1604.6317 1620.6574 1639.7001 2974.3764 2979.6391 3031.3822 3067.8242 3079.7294 3092.9801 3097.4082 3118.3242 3168.3308 3176.0057 3196.7682 3526.7553 3537.4419
redmass: 4.0445 3.6318 4.5443 4.5909 4.7331 4.8554 3.2346 1.0295 3.7793 1.2071 2.8100 2.2541 4.2488 2.7955 4.6214 3.0832 3.0259 2.8390 2.4230 5.5869 1.2345 7.1187 7.0068 4.5042 6.2767 5.5519 1.3550 4.1817 1.4878 3.0005 1.3202 1.3567 1.7176 1.7689 1.3027 2.9262 3.1928 1.2943 2.1436 1.9585 1.4842 2.1730 1.8439 1.9534 2.2210 1.4755 1.5445 1.3632 3.6668 1.2314 1.2310 4.4022 1.2602 1.1559 1.0796 1.1989 1.0746 2.3469 2.5071 7.4169 6.1221 4.3727 1.0380 1.0365 1.0853 1.0979 1.0981 1.0999 1.1000 1.0901 1.0910 1.0950 1.0955 1.0767 1.0766
irintensity: 0.1121 0.0214 9.9914 2.8517 1.8003 0.0325 8.0951 0.0382 4.0418 1.8521 8.1462 8.7547 3.7809 9.8058 1.5549 0.1882 16.6099 6.9723 60.1323 12.6312 130.8908 1.7085 12.3287 2.1700 8.7398 14.5760 31.2613 11.3055 84.3482 0.8522 3.3544 0.1823 1.0096 1.3646 2.9890 4.7767 11.9082 16.5690 44.8862 5.0022 45.3933 68.3158 83.2549 249.1638 8.8134 12.6677 20.1898 3.4687 105.7475 25.1166 40.8182 4.8286 183.4191 113.0808 26.2930 79.7257 53.7680 10.3743 755.4192 12.0289 13.2423 150.7905 25.3410 32.8089 0.3566 9.0629 70.2944 26.9099 33.8093 18.2388 2.8463 3.6382 10.7038 5.8600 21.2781
temp: 298.150 k
press: 1.00000 atm
elementType: 9 8 7 7 6 6 6 6 6 6 6 6 6 6 1 1 1 1 1 1 1 1 1 1 1 1 1
symmnumber: 1
zpe: 567317.5 jmol-1
zpe.correction: 0.216080 hartree
zpe.thermalcorrener: 0.230287 hartree
zpe.thermalcorrenthalpy: 0.231231 hartree
zpe.thermalcorrgfe: 0.174129 hartree
zpe.sumelectzpe: -672.412344 hartree
zpe.sumelectthermal: -672.398136 hartree
zpe.sumelectthermalent: -672.397192 hartree
zpe.sumelectthermalfe: -672.454295 hartree
dipole: 4.3039 4.2600 0.9748
dipole: 6.1336
quadrupole: -85.8990 -75.0971 -86.1563
quadrupole: 2.3795 0.8041 1.5874
quadrupole: -3.5148 7.2870 -3.7722 2.3795 0.8041 1.5874
hfenergy: -672.6284233 hartree
pointgroup: C01 [X(C10H13F1N2O1)]
dipole: -1.6704447 -1.7234024 0.250474 debye
polarizability: 200.3352193|2.6197635|122.199054|2.4131449|-3.1828696|69.6610395 unknown
InChI: InChI=1S/C10H13FN2O/c1-7(2)12-10(14)13-9-5-3-8(11)4-6-9/h3-7,12-13H,1-2H3
charge 0 multiplicity 1
27 atoms
F  5.134118 0.477523 0.098734
O  -1.412079 1.32383 -0.341285
N  -2.700556 -0.602754 -0.066967
N  -0.362505 -0.774051 -0.019056
C  -3.986158 0.127038 -0.170775
C  -4.38425 0.763655 1.182129
C  -5.069992 -0.82832 -0.70832
C  -1.484137 0.070891 -0.150764
C  1.008885 -0.401838 -0.001796
C  1.967539 -1.444826 0.132251
C  1.452431 0.9460 -0.105717
C  3.347308 -1.159218 0.16608
C  2.833118 1.234365 -0.070078
C  3.752645 0.181904 0.064836
H  -3.813567 0.941969 -0.896994
H  -2.738672 -1.586447 0.207192
H  -5.305814 1.364076 1.070325
H  -4.569704 -0.0137 1.947405
H  -3.579734 1.429227 1.537971
H  -4.784382 -1.244353 -1.69071
H  -6.026748 -0.290116 -0.824641
H  -5.246209 -1.667834 -0.00683
H  -0.538586 -1.778215 0.051771
H  1.635846 -2.48797 0.211475
H  0.71446 1.741723 -0.217659
H  4.091523 -1.953989 0.268434
H  3.190918 2.265231 -0.148509
