program: Gaussian 09
title: 000285301
version: EM64L-G09RevD.01
frameworkgroup: C1[X(C15H22O5)]
method: RPBEPBE
basis: SDD
operation: Freq
keyword: #pfreq=noraman
keyword: PBEPBE/SDD
title: #p freq=noraman PBEPBE/SDD
converged: YES YES NO NO
title: Mulliken charges:
elementType: O O O O O C C C C C C C C C C C C C C C H H H H H H H H H H H H H H H H H H H H H H
charge: -0.276998 -0.297241 -0.271934 -0.445617 -0.270667 -0.383055 -0.257371 -0.329316 -0.239588 -0.246812 -0.707369 -0.227023 -0.349738 0.347081 -0.354003 -0.371512 0.241847 -0.343776 -0.307197 0.107197 0.184444 0.205379 0.187148 0.184559 0.234117 0.175920 0.178761 0.199434 0.219381 0.177379 0.194532 0.264059 0.201109 0.196117 0.223672 0.230249 0.231212 0.317955 0.253381 0.271810 0.273236 0.379239
chargesum: 0.00000
title: Mulliken charges with hydrogens summed into heavy atoms:
elementType: O O O O O C C C C C C C C C C C C C C C
charge: -0.276998 -0.297241 -0.271934 -0.066377 -0.270667 0.006768 0.114335 0.080721 0.138606 0.149948 -0.047669 0.192766 0.111723 0.347081 -0.036049 -0.118131 0.241847 -0.071966 -0.033961 0.107197
polarizability: 2.21769516e+02 2.91242915e+01 2.23558314e+02 1.16900783e+01 -1.07265553e+01 1.14628452e+02
1716.lowfreq: 0.0004 0.0005 0.0006 1.9824 6.7576 7.6687 18.5791 31.4609 33.2321
frequency: 18.1188 31.4430 33.1571 52.6903 57.5924 63.7735 78.5708 89.2634 98.2447 99.9222 125.7756 133.5198 146.1263 194.1277 204.8854 236.5771 240.4192 254.3897 265.8171 289.9109 306.9142 338.6615 359.8017 418.7106 429.0548 473.9884 494.6217 499.6949 520.1012 534.3725 553.9404 583.1865 627.4852 669.3708 686.6894 738.2373 756.0234 771.8413 798.0970 801.0215 839.0703 842.5209 870.1608 876.0482 890.7346 937.6227 960.5714 970.9917 981.4542 990.3279 997.2540 1017.4789 1023.9147 1033.2653 1044.3878 1057.1833 1071.0553 1080.1274 1089.0127 1110.7344 1121.6736 1130.9559 1146.9007 1151.1731 1189.2787 1195.1450 1205.4334 1216.8685 1220.5273 1242.3255 1259.7171 1279.0588 1289.1793 1307.8804 1308.7751 1321.3543 1336.0228 1345.0345 1361.9467 1363.0493 1381.7309 1392.7576 1394.9979 1413.6865 1431.5615 1451.0830 1451.9813 1456.5744 1457.8116 1473.3557 1477.5843 1482.9202 1488.1423 1489.3835 1498.2782 1573.7442 1617.5568 1635.3304 2905.1410 2914.3896 2922.0687 2936.1303 2954.6311 2965.7464 2968.3137 2971.2256 2979.4964 2985.9041 3000.8115 3009.1815 3027.7108 3044.8840 3070.1623 3078.0176 3091.2720 3147.0200 3159.1069 3173.1795 3181.7724 3532.6995
redmass: 4.5488 5.6594 3.7414 3.4607 3.6082 4.1420 2.1378 4.4088 4.2676 4.2940 3.1744 5.5489 4.4557 3.9458 2.1474 2.3007 1.3025 4.1484 2.1538 4.3122 4.7835 3.2430 3.2424 3.0351 4.3454 3.2727 2.8846 2.7295 3.7926 2.8889 4.5548 1.2276 6.8885 4.3908 3.8462 1.2394 4.5668 4.0647 1.7246 2.9532 2.0293 1.3199 1.5683 2.1405 2.0805 2.5775 1.6904 1.5099 1.3487 1.7840 2.4400 2.9982 2.6290 3.0628 2.4439 3.3167 2.4950 2.7903 2.8975 2.4066 1.3508 1.9664 1.7839 1.6772 1.3242 1.1087 1.1344 1.2601 2.3953 1.2646 1.1230 1.1794 1.1399 1.2589 1.2821 2.9019 1.2273 1.2724 1.5952 1.3045 4.8024 1.3699 1.2122 1.5582 3.8216 1.0847 1.0837 1.1049 1.0859 1.0872 1.0424 1.0816 1.0542 1.0872 2.4951 7.4435 6.1293 8.2234 1.0553 1.0572 1.0601 1.0596 1.1006 1.0654 1.0373 1.1018 1.0665 1.0964 1.1014 1.0662 1.0939 1.0994 1.1007 1.0994 1.1026 1.0914 1.0885 1.0943 1.0972 1.0641
irintensity: 0.0872 0.8783 0.2809 0.3330 1.5849 0.6993 0.1327 2.8505 2.7359 5.4035 4.8681 8.9152 1.2688 2.6612 3.0500 2.5970 0.3654 0.4621 1.4916 5.3116 5.8079 0.2713 2.9970 1.1414 2.5785 21.5071 20.4158 13.3774 8.6454 2.8879 61.9707 78.0188 8.1545 4.0941 64.5699 6.1489 20.3511 4.8656 13.5382 14.2885 1.4103 11.2456 61.7321 5.3741 23.6276 51.7448 27.1310 13.9815 1.5410 55.6333 117.7393 178.8468 22.7420 3.3184 24.0265 78.0305 18.7783 59.7920 25.5669 16.7024 22.9828 7.7362 5.1743 220.8796 29.2502 12.3265 13.1026 5.1342 165.2343 0.8525 4.1188 70.0175 0.4263 0.8059 6.8160 157.9798 32.6394 10.6174 0.5707 5.2895 34.6982 4.3148 15.2220 2.3615 3.0849 9.0514 6.4467 13.6351 8.0782 8.0289 11.0101 6.0579 12.6854 13.1443 78.6404 0.7065 282.4343 283.5681 30.7518 69.7264 51.8111 164.6984 47.7097 22.7816 28.5275 56.5919 98.4143 26.1769 57.5704 56.6665 25.2233 1.3033 102.2117 23.4876 24.9464 19.2484 2.6270 1.4512 4.8388 46.7839
temp: 298.150 k
press: 1.00000 atm
elementType: 8 8 8 8 8 6 6 6 6 6 6 6 6 6 6 6 6 6 6 6 1 1 1 1 1 1 1 1 1 1 1 1 1 1 1 1 1 1 1 1 1 1
symmnumber: 1
zpe: 911193.8 jmol-1
zpe.correction: 0.347055 hartree
zpe.thermalcorrener: 0.368718 hartree
zpe.thermalcorrenthalpy: 0.369663 hartree
zpe.thermalcorrgfe: 0.293528 hartree
zpe.sumelectzpe: -959.329235 hartree
zpe.sumelectthermal: -959.307572 hartree
zpe.sumelectthermalent: -959.306628 hartree
zpe.sumelectthermalfe: -959.382762 hartree
dipole: -4.4098 -2.3752 -0.0630
dipole: 5.0091
quadrupole: -98.5217 -113.4058 -120.9696
quadrupole: 4.5753 3.4995 0.1128
quadrupole: 12.4440 -2.4401 -10.0039 4.5753 3.4995 0.1128
hfenergy: -959.6762904 hartree
pointgroup: C01 [X(C15H22O5)]
dipole: 1.3629642 -1.4195549 0.1049381 debye
polarizability: 195.3608157|-30.2263787|235.391295|28.2628694|20.0764429|129.2041716 unknown
InChI: InChI=1S/C15H22O5/c1-2-3-8-18-9-10-19-11-12-20-14-6-4-13(5-7-14)15(16)17/h4-7,16H,2-3,8-12H2,1H3
charge 0 multiplicity 1
42 atoms
O  3.508372 0.372002 0.370715
O  2.148079 -2.333007 0.149064
O  -0.880575 -3.082278 -1.076278
O  -4.082757 2.442436 -1.022835
O  -2.324641 3.117949 0.333271
C  3.364513 2.761192 0.818793
C  3.938528 1.426504 1.305362
C  1.820338 2.789926 0.803338
C  4.055237 -0.935197 0.7270
C  3.51674 -1.973201 -0.246611
C  1.241626 4.143767 0.341602
C  1.596155 -3.413067 -0.674842
C  0.157097 -3.698543 -0.225953
C  -1.30617 -1.768062 -0.84241
C  -0.625173 -0.834351 -0.019224
C  -2.503567 -1.405956 -1.515928
C  -2.366538 0.830095 -0.527605
C  -1.167969 0.454764 0.133006
C  -3.029238 -0.114913 -1.359536
C  -2.870992 2.206492 -0.341807
H  3.749357 3.565027 1.480022
H  3.751801 2.967291 -0.198505
H  5.051816 1.46205 1.338482
H  3.568069 1.189149 2.329016
H  1.464952 1.98113 0.13919
H  1.443829 2.555624 1.82144
H  5.167812 -0.912297 0.662903
H  3.772147 -1.218036 1.76498
H  3.526107 -1.559439 -1.27687
H  4.160435 -2.881346 -0.217694
H  1.572271 4.967107 1.004118
H  0.136997 4.121312 0.346709
H  1.574309 4.386277 -0.685897
H  2.215784 -4.328545 -0.539933
H  1.604631 -3.145651 -1.75329
H  -0.056792 -4.775507 -0.325121
H  0.03086 -3.397884 0.831922
H  0.333538 -1.090263 0.442225
H  -2.998171 -2.152808 -2.143935
H  -0.661289 1.195742 0.758479
H  -3.951114 0.175699 -1.870483
H  -4.353313 3.384515 -0.85508
