program: Gaussian 09
title: 000285038
version: EM64L-G09RevD.01
frameworkgroup: C1[X(C9H9NO2)]
method: RPBEPBE
basis: SDD
operation: Freq
keyword: #pfreq=noraman
keyword: PBEPBE/SDD
title: #p freq=noraman PBEPBE/SDD
converged: YES YES NO NO
title: Mulliken charges:
elementType: O O N C C C C C C C C C H H H H H H H H H
charge: -0.195163 -0.198122 0.018883 0.326649 0.221414 -0.387128 -0.369966 -0.209453 -0.226386 -0.223575 -0.232577 -0.723740 0.245979 0.284551 0.243692 0.231084 0.232170 0.233805 0.244049 0.256166 0.227669
chargesum: 0.00000
title: Mulliken charges with hydrogens summed into heavy atoms:
elementType: O O N C C C C C C C C C
charge: -0.195163 -0.198122 0.018883 0.326649 0.221414 -0.141149 -0.085416 0.034239 0.004698 0.008595 0.001228 0.004144
polarizability: 1.59110843e+02 -1.42362316e+01 1.17990074e+02 6.75067518e-01 -9.11459698e+00 6.40357358e+01
1716.lowfreq: -10.6534 -7.7644 -6.6384 -0.0008 -0.0006 -0.0005 26.8099 59.0224 100.3603
frequency: 26.6278 59.0047 100.3539 119.1215 150.0175 225.9501 266.4297 303.6039 321.4139 358.0427 405.3695 457.8150 507.2471 601.6843 620.2725 655.0610 700.4623 708.9128 762.8597 775.0646 847.3037 854.4769 917.3824 932.7124 980.2542 981.4315 988.8504 1001.1106 1033.5031 1039.9287 1086.8430 1128.2739 1175.0454 1196.8332 1215.8984 1245.4688 1304.8015 1321.9384 1367.8781 1374.3912 1400.2796 1433.3430 1457.4406 1461.5971 1479.5385 1579.6348 1608.1140 1646.3453 2977.7334 3053.5107 3106.6585 3124.8267 3127.7234 3136.8864 3149.4221 3164.9833 3188.7557
redmass: 6.4238 3.4611 2.4089 1.7358 3.7888 3.8154 3.3203 4.1233 7.0781 4.5946 2.8826 4.8179 3.6379 6.4180 6.6109 5.6350 2.5344 2.9101 6.2765 2.0237 1.2186 1.2435 3.0138 1.6186 1.6321 1.9168 4.2897 1.3343 2.0634 1.5797 1.6298 2.4946 1.0530 1.1305 9.2055 4.1156 1.3240 1.4111 5.7509 6.5804 1.2130 2.2485 1.0767 1.1168 2.1531 5.7450 6.0515 6.8717 1.0409 1.0929 1.0938 1.0933 1.0857 1.0887 1.0944 1.0996 1.0951
irintensity: 0.6195 1.5255 1.1120 0.9358 1.8569 3.0399 0.2474 0.7341 0.2399 1.5509 0.1349 0.3825 8.3149 4.7008 4.7954 4.2131 28.4710 27.0254 19.1302 66.2380 18.3105 1.9808 1.5939 5.6755 11.2561 6.0967 2.7909 1.1783 4.7892 5.8461 7.4450 3.4584 0.4301 4.5303 118.9197 31.8821 21.4641 8.6331 133.4263 6.7961 8.8970 12.4843 19.9423 21.8003 12.2519 1.7894 0.6140 7.1273 11.8307 17.6881 5.1398 18.1754 0.4558 3.6138 27.1101 21.8192 5.1273
temp: 298.150 k
press: 1.00000 atm
elementType: 8 8 7 6 6 6 6 6 6 6 6 6 1 1 1 1 1 1 1 1 1
symmnumber: 1
zpe: 419987.5 jmol-1
zpe.correction: 0.159965 hartree
zpe.thermalcorrener: 0.170978 hartree
zpe.thermalcorrenthalpy: 0.171922 hartree
zpe.thermalcorrgfe: 0.121855 hartree
zpe.sumelectzpe: -552.587396 hartree
zpe.sumelectthermal: -552.576383 hartree
zpe.sumelectthermalent: -552.575439 hartree
zpe.sumelectthermalfe: -552.625505 hartree
dipole: -1.8621 -3.7149 -1.1981
dipole: 4.3247
quadrupole: -64.0958 -67.8135 -73.1455
quadrupole: -8.1198 -4.7230 -2.2418
quadrupole: 4.2558 0.5381 -4.7939 -8.1198 -4.7230 -2.2418
hfenergy: -552.7473604 hartree
pointgroup: C01 [X(C9H9N1O2)]
dipole: -0.752262 -1.4258062 -0.5442777 debye
dipolederiv: -0.5896942 -0.040812 -0.3216472 -0.0651853 -0.4099258 0.0065855 -0.359496 0.0789297 -0.474422 -0.4116775 -0.0265393 -0.1093859 0.1338176 -0.7770524 0.1410442 -0.2017231 0.0660958 -0.3779807 0.577802 0.1994811 0.5497208 0.0246752 1.1725104 -0.1285574 0.6167047 -0.0694056 0.6866076 0.1679112 0.0307456 -0.0075977 -0.1129795 -0.1027981 -0.08159 -0.0673082 0.0431416 0.0273824 0.366423 -0.0469523 -0.0781049 0.0345777 -0.2781593 0.0173667 0.0255908 -0.0864726 -0.0688254 -0.0851342 -0.0874126 0.0303706 0.037663 -0.0286842 -0.0734547 0.0279954 -0.0628828 -0.1133899 -0.0989182 0.0886184 -0.031358 0.0193256 -0.0072499 -0.0360032 -0.0299137 -0.017488 -0.1206204 0.1517356 -0.2977623 -0.0503709 -0.056372 0.210373 0.1467209 0.0990612 -0.0313216 -0.138115 -0.0422185 0.1061454 -0.0388954 0.1032478 0.034734 -0.0802212 -0.0510553 -0.0724483 -0.1104967 -0.0400665 -0.0987677 0.0458455 -0.1185437 0.078699 -0.0919937 0.0634575 -0.0922725 -0.1151051 0.0745011 0.0021038 -0.0008088 -0.0090745 -0.0567372 -0.0344134 0.0037973 -0.0390967 -0.1382995 -0.2215197 0.123598 -0.0072005 0.1983295 -0.0728223 -0.0355183 -0.1440565 0.1020346 0.1152977 0.0388454 0.0929644 -0.042324 0.0670036 0.0008339 0.0702035 -0.0423942 0.0586183 0.1139567 0.1378183 -0.0615888 0.0406647 -0.0416654 0.0509046 0.0478061 0.0380874 0.0275471 0.1447377 -0.0200195 -0.0633594 -0.0364756 -0.1261739 0.0354624 -0.0545314 -0.0271298 -0.0257356 0.1136356 0.0096394 -0.076151 0.0303183 -0.0980307 -0.0256623 0.0760932 0.0356476 0.0772049 0.1268041 0.0238945 0.0751608 -0.0261751 0.0933009 -0.0415368 0.0757151 -0.0341907 0.075121 0.1266886 -0.1305945 0.0095882 -0.0016924 0.0055275 0.1026172 0.0239744 -0.002038 0.0215813 0.1534554 0.0118368 0.0640074 0.0110927 0.0191481 0.0392988 0.0971588 -0.0376789 0.108331 0.0110298 0.0460964 -0.0428796 0.0071828 -0.1228161 -0.013172 -0.005627 -0.0102394 -0.0404757 0.0979072 0.033339 0.0498118 0.036841 0.0142246 0.0883671 -0.0807581 0.0968819 -0.121006 -0.0602479 unknown
polarizability: 157.9158318|-15.1076275|119.3435894|4.8025207|-8.5931616|63.8772309 unknown
InChI: InChI=1S/C9H9NO2/c1-2-9(10(11)12)8-6-4-3-5-7-8/h2-7H,1H3
charge 0 multiplicity 1
21 atoms
O  2.725758 0.74352 1.29055
O  1.513018 2.118946 -0.058956
N  1.785928 0.955238 0.431044
C  -0.501435 -0.07494 -0.053784
C  0.983636 -0.213076 -0.036866
C  -1.272248 -1.189788 0.386118
C  -1.18261 1.093285 -0.494203
C  1.65489 -1.343326 -0.413631
C  -2.681679 -1.145309 0.370492
C  -2.59379 1.134306 -0.499174
C  -3.35018 0.018989 -0.073023
C  3.131538 -1.631581 -0.396313
H  -0.762497 -2.079593 0.77256
H  -0.606479 1.955225 -0.837129
H  1.017398 -2.141401 -0.818668
H  -3.255358 -2.010524 0.720368
H  -3.102107 2.041235 -0.844364
H  -4.444934 0.05856 -0.078606
H  3.366883 -2.33439 0.428088
H  3.749689 -0.735474 -0.235631
H  3.431678 -2.126404 -1.337773
