program: Gaussian 09
title: 000285059
version: EM64L-G09RevD.01
frameworkgroup: C1[X(C24H24N2O)]
method: RPBEPBE
basis: SDD
operation: Freq
keyword: #p
keyword: freq=noraman
keyword: PBEPBE/SDD
title: #p freq=noraman PBEPBE/SDD
converged: YES YES NO NO
title: Mulliken charges:
elementType: O N N C C C C C C C C C C C C C C C C C C C C C C C C H H H H H H H H H H H H H H H H H H H H H H H H
charge: -0.259078 -0.466862 -0.386471 0.408152 0.232283 0.220522 0.208954 0.084223 0.307366 -0.750701 0.454012 -0.419425 -0.530145 -0.379004 -0.376029 -0.325705 -0.447465 -0.346209 -0.363145 -0.478728 -0.270720 0.150670 -0.284425 -0.342455 -0.269299 -0.252492 -0.686889 0.297005 0.222300 0.233454 0.226381 0.218423 0.381510 0.243902 0.216358 0.193171 0.182594 0.202767 0.240653 0.247408 0.243382 0.228915 0.228058 0.273257 0.196812 0.195164 0.228343 0.227284 0.220246 0.211479 0.210205
chargesum: 0.00000
title: Mulliken charges with hydrogens summed into heavy atoms:
elementType: O N N C C C C C C C C C C C C C C C C C C C C C C C C
charge: -0.259078 -0.085353 -0.113214 0.408152 0.232283 0.220522 0.208954 0.084223 0.307366 -0.453696 0.454012 -0.197125 -0.296691 -0.152623 -0.157605 -0.081803 -0.206812 0.063319 0.022217 0.012062 -0.041805 0.150670 -0.056367 0.049521 -0.040957 -0.025208 -0.044960
polarizability: 4.63495639e+02 -4.33251603e+01 3.50149663e+02 3.10720989e+00 -1.61506775e+00 1.30688124e+02
1716.lowfreq: -7.7037 -0.0012 -0.0004 0.0006 2.8908 5.3875 13.8023 22.2173 37.6143
frequency: 12.9746 22.1659 37.5583 50.5602 60.8463 67.2194 80.5906 85.6722 93.9892 119.0079 132.1690 141.8913 173.1065 181.0958 204.7754 226.5537 231.9945 244.4602 268.1162 273.7750 304.1690 319.3016 341.6907 386.0494 418.2650 427.4852 433.2496 458.4938 484.6098 487.9827 517.4266 522.4710 556.4303 559.1037 563.5796 569.8170 587.7626 626.7002 640.4467 670.7153 683.9433 696.9545 731.5916 739.0323 748.2091 762.6217 766.3987 785.4582 802.2524 811.4495 822.0753 837.6748 866.9807 881.9013 886.4441 894.6433 898.0923 910.4110 922.6807 937.6970 944.0246 957.9530 959.3498 962.7172 979.1141 987.0919 992.9899 1015.2018 1031.0753 1039.1579 1039.8716 1050.0689 1071.1320 1083.1846 1112.9722 1122.4883 1133.1946 1136.3179 1157.6312 1164.5822 1178.5284 1185.7686 1200.3756 1208.1496 1237.8699 1242.0348 1248.3711 1253.4595 1270.6912 1276.5343 1281.6927 1284.2476 1289.1021 1306.7647 1311.2204 1346.1607 1368.0652 1374.5692 1387.4399 1391.9074 1402.4426 1409.0334 1414.7607 1437.1205 1446.8397 1448.3729 1453.6802 1456.7426 1467.1466 1473.7164 1474.3981 1477.7492 1484.9383 1493.6593 1517.8243 1524.0791 1544.6118 1574.2893 1604.2643 1610.3706 1621.8945 1625.0070 1628.1826 2901.7412 2957.9086 2972.2494 2975.5421 2976.6710 3002.8733 3015.1079 3038.9102 3043.1752 3072.3396 3076.6335 3120.0942 3120.4938 3125.4619 3134.8281 3135.2202 3151.3474 3151.9120 3160.9527 3166.5765 3172.5160 3195.5708 3265.2663 3432.9808
redmass: 4.6151 4.7203 4.0436 2.0562 4.6208 4.1346 5.0499 3.4791 2.4739 2.1119 3.3145 3.1700 3.3038 4.2770 4.5369 2.0203 1.6631 7.5548 3.5804 4.1789 6.1026 4.6046 4.0236 5.1962 3.2514 3.4594 3.0066 4.6801 3.8545 5.2269 5.9753 4.2385 3.8286 3.2458 7.5916 3.6668 3.7653 5.7582 3.1615 5.2477 4.7650 3.3012 1.4357 1.1067 1.3265 5.9870 1.4427 1.9888 1.1567 1.8418 4.8275 1.4746 6.1964 4.1284 2.0016 2.0133 1.8978 1.6877 2.6954 1.2076 1.9991 1.4504 1.5638 1.5884 1.5658 1.3477 1.3470 5.5128 3.7449 1.9392 2.0472 2.4146 3.4490 2.3027 2.4033 2.3740 4.1680 1.3949 1.6832 1.3493 1.1666 1.1710 1.8885 1.5298 2.1093 1.3164 1.6202 1.7958 1.6032 1.3274 1.6526 1.4936 1.0863 1.7281 1.3735 1.4637 2.6050 1.6942 3.9988 1.2207 3.1786 5.1193 2.5864 3.4509 1.2147 2.5849 1.2057 1.9834 1.0753 1.3720 1.7026 1.0430 1.0770 1.1057 3.2027 3.6504 2.7969 7.7562 6.2600 6.2618 7.4502 5.3561 6.0523 1.0693 1.0615 1.0599 1.0368 1.0616 1.0921 1.0964 1.1029 1.0994 1.1009 1.0994 1.0856 1.0862 1.0878 1.0893 1.0892 1.0949 1.0948 1.0970 1.0993 1.0948 1.0904 1.0758 1.0744
irintensity: 0.1054 0.5314 0.0047 0.6231 5.1607 0.4346 2.5147 0.0014 1.7987 0.5921 0.9083 1.6041 0.8126 0.6098 1.2230 2.2925 1.5154 2.4262 2.0244 1.6970 1.6059 0.7143 1.2152 9.9895 1.4343 3.7297 11.6889 14.4494 1.6855 15.2932 6.6746 2.9433 3.9239 4.6811 0.9440 10.0238 10.5070 0.7293 3.5894 8.9687 2.5893 0.5015 66.2710 31.5536 10.7416 0.3144 122.1925 2.7803 0.9942 4.2991 3.0907 65.6155 2.1527 0.1437 6.6986 8.1117 1.2631 21.3801 12.5806 4.4061 20.9936 6.7101 2.3418 38.2760 8.3899 0.4848 0.0050 0.8947 0.5356 25.4471 7.0105 5.9745 0.3324 2.1826 6.5528 2.9789 87.7685 9.1431 0.3417 0.4696 1.3391 0.7363 4.3338 0.5728 1.4204 2.9269 26.8721 5.2449 0.9284 0.0964 2.7330 2.4810 0.9930 9.9836 10.7816 4.0554 20.8358 15.5279 6.8566 13.0313 21.7618 1.2377 4.1829 16.2384 24.4595 1.6735 62.6557 14.7218 2.5899 78.2289 116.4410 11.8417 10.8502 9.3453 285.4399 88.5790 401.4936 3.5989 32.5575 32.0965 57.2167 41.2489 68.9144 109.0409 13.6843 59.7121 37.4375 34.6050 12.9408 4.2298 63.7330 13.1500 84.4065 56.4957 5.7542 1.7652 4.2462 4.2309 26.1457 47.0309 9.2508 21.2073 34.5568 40.5418 2.0007 397.0914 0.7344
temp: 298.150 k
press: 1.00000 atm
elementType: 8 7 7 6 6 6 6 6 6 6 6 6 6 6 6 6 6 6 6 6 6 6 6 6 6 6 6 1 1 1 1 1 1 1 1 1 1 1 1 1 1 1 1 1 1 1 1 1 1 1 1
symmnumber: 1
zpe: 1103623.0 jmol-1
zpe.correction: 0.420348 hartree
zpe.thermalcorrener: 0.444123 hartree
zpe.thermalcorrenthalpy: 0.445068 hartree
zpe.thermalcorrgfe: 0.364675 hartree
zpe.sumelectzpe: -1111.828675 hartree
zpe.sumelectthermal: -1111.804900 hartree
zpe.sumelectthermalent: -1111.803955 hartree
zpe.sumelectthermalfe: -1111.884348 hartree
dipole: -5.0019 1.6592 -0.5130
dipole: 5.2948
quadrupole: -122.0259 -153.1901 -165.1581
quadrupole: 7.9812 2.1666 1.0329
quadrupole: 24.7654 -6.3987 -18.3667 7.9812 2.1666 1.0329
hfenergy: -1112.2490229 hartree
pointgroup: C01 [X(C24H24N2O1)]
dipole: 1.7967257 0.8606428 0.6087606 debye
polarizability: 440.2704342|61.4754831|314.9878249|18.7189234|103.0217819|189.0751669 unknown
InChI: InChI=1S/C24H24N2O/c1-2-3-14-25-16-24(27)26-23-15-22-18-9-5-4-8-17(18)12-13-20(22)19-10-6-7-11-21(19)23/h4-13,15,25-26H,2-3,14,16H2,1H3
charge 0 multiplicity 1
51 atoms
O  1.468682 -2.879093 -1.6005
N  1.762641 -0.842458 -0.414062
N  4.391591 -1.060993 -0.263386
C  -2.000752 -0.736271 -0.213493
C  -2.21403 0.486202 0.502987
C  -1.05991 1.287298 0.909438
C  0.280112 0.845692 0.596167
C  -3.145258 -1.548621 -0.630296
C  0.447435 -0.40866 -0.125358
C  -0.662207 -1.156321 -0.512674
C  -4.480308 -1.104833 -0.305899
C  -3.564661 0.890674 0.803535
C  -4.654259 0.127835 0.417023
C  -1.20917 2.520843 1.621051
C  1.393416 1.649804 1.003114
C  -3.005477 -2.777085 -1.351882
C  -5.609201 -1.88839 -0.703307
C  5.641882 -0.421091 -0.753501
C  6.178819 0.595692 0.271331
C  3.736313 -2.024471 -1.182392
C  -0.10672 3.289535 2.009049
C  2.191319 -1.973548 -1.083118
C  1.210155 2.850553 1.696404
C  7.482372 1.283976 -0.194885
C  -4.124358 -3.529079 -1.732042
C  -5.439924 -3.084991 -1.406474
C  8.011072 2.311824 0.828208
H  -0.474565 -2.084106 -1.052905
H  -3.745617 1.819811 1.350392
H  -5.672278 0.455886 0.65834
H  -2.209089 2.883393 1.873482
H  2.419671 1.341695 0.774741
H  2.588134 -0.300424 -0.092983
H  -2.011661 -3.147037 -1.618969
H  5.405434 0.096837 -1.703129
H  6.436719 -1.170512 -0.980986
H  6.365141 0.082916 1.239218
H  5.397834 1.358639 0.462726
H  -6.614108 -1.532527 -0.44602
H  4.001603 -1.76284 -2.224214
H  4.040734 -3.080134 -1.03351
H  -0.257147 4.229091 2.551598
H  2.076187 3.450478 1.9963
H  4.533469 -1.46946 0.671633
H  7.301971 1.787358 -1.166322
H  8.258215 0.513828 -0.381467
H  -3.986973 -4.465488 -2.283801
H  -6.309224 -3.679899 -1.70753
H  8.941014 2.791152 0.472349
H  7.267128 3.11016 1.009123
H  8.229835 1.829959 1.799697
