program: Gaussian 09
title: 000285315
version: EM64L-G09RevD.01
frameworkgroup: C1[X(C19H23Cl2N7)]
method: RPBEPBE
basis: SDD
operation: Freq
keyword: #p
keyword: freq=noraman
keyword: PBEPBE/SDD
title: #p freq=noraman PBEPBE/SDD
converged: YES YES NO NO
title: Mulliken charges:
elementType: Cl Cl N N N N N N N C C C C C C C C C C C C C C C C C C C H H H H H H H H H H H H H H H H H H H H H H H
charge: -0.037642 -0.033732 -0.080994 -0.423361 -0.225859 -0.100988 -0.346867 -0.489167 -0.079201 -0.016771 -0.489964 -0.432719 -0.399933 -0.354670 -0.301604 -0.716382 0.328563 -0.501994 0.269720 0.014452 -0.784002 0.077709 0.326497 0.024542 -0.339074 -0.335797 -0.058595 -0.081252 0.240549 0.188921 0.234107 0.181079 0.249143 0.214678 0.204878 0.226936 0.167858 0.182183 0.219021 0.305639 0.239495 0.214934 0.223698 0.231271 0.362733 0.232906 0.257993 0.231801 0.421560 0.282363 0.275342
chargesum: 0.00000
title: Mulliken charges with hydrogens summed into heavy atoms:
elementType: Cl Cl N N N N N N N C C C C C C C C C C C C C C C C C C C
charge: -0.037642 -0.033732 -0.080994 -0.117722 -0.225859 -0.100988 0.015866 -0.067607 -0.079201 0.223777 -0.066936 -0.002497 0.019623 0.040124 0.099600 -0.038256 0.328563 -0.270724 0.269720 0.014452 -0.061303 0.077709 0.326497 0.024542 -0.056711 -0.060455 -0.058595 -0.081252
polarizability: 4.51273691e+02 1.92607655e+01 3.03898728e+02 -7.31081568e-01 -1.47050153e+01 1.52121619e+02
1716.lowfreq: -81.2698 -3.3881 -0.0010 0.0009 0.0014 3.9079 9.9384 26.9169 30.1558
frequency: -81.2680 26.3993 30.0784 33.2988 42.4999 55.4017 67.1267 90.4990 100.2449 119.9753 130.7989 144.5157 150.5490 178.9619 193.3932 199.2789 209.8488 218.4652 234.8820 248.3311 251.4315 270.5577 282.2837 298.4729 311.9237 324.8294 348.7575 364.5735 389.4542 391.2991 403.7286 428.7388 432.8247 443.2524 469.7470 493.4741 494.3532 516.1736 544.7039 578.5872 586.1412 625.0149 625.5884 653.4700 658.1428 677.7453 701.7865 709.9464 725.7855 745.0648 746.7367 754.0285 766.2565 800.9997 831.5434 836.8750 846.8126 864.3301 867.4514 872.7825 894.6626 903.8090 912.3163 930.0884 949.3448 950.4673 961.3707 981.5458 990.9616 1008.5477 1047.7729 1051.4045 1075.0124 1080.9016 1087.0503 1100.8475 1106.5878 1123.6752 1130.7478 1149.2970 1152.3274 1153.2098 1191.0445 1198.6705 1216.9045 1224.3532 1231.2991 1254.1641 1259.6984 1272.1614 1278.7730 1288.5674 1295.1106 1313.6065 1317.2604 1338.1025 1348.1957 1352.3653 1364.7616 1368.6037 1373.5787 1389.2236 1391.1274 1398.6597 1403.7063 1417.4184 1441.6736 1450.0962 1458.8971 1459.6337 1463.2812 1466.3679 1469.1504 1472.0949 1474.8951 1478.5319 1481.7341 1486.7724 1492.6261 1546.0774 1559.9818 1579.3954 1604.4849 1640.8355 2823.9622 2832.0828 2851.4896 2955.4039 2989.1399 2992.2362 2995.9076 3012.7540 3014.5268 3038.2062 3043.6673 3058.9579 3063.5122 3069.1930 3084.5253 3094.2048 3122.1117 3156.4427 3159.0910 3183.9802 3326.8295 3561.3072 3562.3246
redmass: 1.0242 6.1689 5.7051 6.7939 4.2438 4.6562 4.3604 2.8229 5.9104 6.4534 2.4350 3.4150 3.6454 11.9799 7.4999 5.3861 3.6129 3.4926 3.8220 1.7101 3.4174 6.2304 2.0851 6.9726 6.9003 3.4391 2.9447 5.8751 3.8711 8.7101 3.4195 4.6891 3.0711 2.7724 1.1949 2.2907 3.3379 5.1933 5.3517 3.3407 2.9541 7.5411 7.5757 6.3806 1.8120 3.3131 3.6481 6.3404 6.4264 4.0390 5.6420 2.4347 3.9229 1.1519 1.6391 3.8164 2.3695 1.5074 1.4033 1.3351 1.1683 2.2870 7.1662 7.8154 2.1744 3.0655 2.4211 1.9527 1.6274 3.8092 1.5909 2.1579 2.3609 1.8661 2.5098 2.6985 2.2366 2.2297 1.9328 1.4717 2.2276 2.3328 2.2565 2.0201 2.0811 1.5091 1.6742 1.7850 1.9749 1.2973 1.4678 2.7876 1.4889 1.7978 1.3949 1.3987 1.4333 1.5174 1.4245 3.7320 2.2014 1.3437 1.4403 1.2483 5.0775 5.2166 2.1545 4.1641 1.1465 1.2924 1.3011 1.0861 1.0465 1.0818 1.1213 1.9835 1.2593 2.8235 1.0734 4.2977 5.6588 7.1128 7.1720 6.9459 1.0716 1.0704 1.0702 1.0643 1.0381 1.0362 1.0615 1.0879 1.0835 1.0912 1.0934 1.0993 1.0916 1.0973 1.0981 1.1000 1.0984 1.0928 1.0942 1.0932 1.0849 1.0774 1.0768
irintensity: 0.3257 0.2837 0.0850 0.0158 0.2287 0.0692 0.1666 0.4839 0.5871 0.4872 1.8656 0.0826 0.0617 0.3134 3.0241 0.0228 1.1077 0.1938 1.6270 0.3724 2.5371 3.5303 1.3364 4.1886 2.6450 0.1850 2.0524 14.4009 1.1084 5.2603 2.1516 13.9473 8.3768 10.1575 78.8079 4.2575 9.7559 4.4460 28.9444 0.3521 1.0311 10.1572 17.3206 2.7410 40.4752 24.1027 42.7295 7.7984 4.5990 3.1977 10.0713 8.2139 4.1180 3.2047 46.2907 0.5810 0.7477 5.6231 0.2021 8.9005 105.8521 3.8444 58.8786 6.4737 15.2111 16.0957 19.8258 9.6292 3.7988 0.7185 6.9564 10.3920 5.8895 45.9506 6.3342 15.7609 13.8891 6.1315 15.5129 7.7722 57.0793 6.1135 10.8624 31.1115 8.3024 2.2751 3.3476 41.9709 26.2523 4.2534 24.3038 50.1308 12.8040 19.0323 2.1148 6.1995 5.5066 10.8550 2.5376 109.0746 15.9037 21.2179 14.6197 21.2689 73.8062 23.2531 298.4391 93.6745 16.2870 0.4208 26.5375 5.3607 17.9923 2.5104 12.9357 18.6976 76.3738 328.0549 11.8305 702.9451 94.6037 418.7455 560.6267 288.9698 45.2674 65.1789 206.9858 37.2964 20.4411 19.7661 26.5479 18.2737 12.4430 48.0590 22.6675 50.7030 33.4490 15.6052 39.7331 37.5836 8.4953 6.3943 5.0954 0.0916 486.5672 72.9475 73.6827
temp: 298.150 k
press: 1.00000 atm
elementType: 17 17 7 7 7 7 7 7 7 6 6 6 6 6 6 6 6 6 6 6 6 6 6 6 6 6 6 6 1 1 1 1 1 1 1 1 1 1 1 1 1 1 1 1 1 1 1 1 1 1 1
symmnumber: 1
zpe: 1062630.3 jmol-1
zpe.correction: 0.404734 hartree
zpe.thermalcorrener: 0.430113 hartree
zpe.thermalcorrenthalpy: 0.431058 hartree
zpe.thermalcorrgfe: 0.348532 hartree
zpe.sumelectzpe: -2039.192219 hartree
zpe.sumelectthermal: -2039.166840 hartree
zpe.sumelectthermalent: -2039.165896 hartree
zpe.sumelectthermalfe: -2039.248422 hartree
dipole: -9.2287 5.9476 0.1585
dipole: 10.9804
quadrupole: -176.5976 -174.1701 -180.3146
quadrupole: -3.5674 3.5443 -0.7783
quadrupole: 0.4298 2.8574 -3.2871 -3.5674 3.5443 -0.7783
hfenergy: -2039.5969535 hartree
pointgroup: C01 [X(C19H23Cl2N7)]
dipole: 4.0917465 -1.1603386 -0.7574138 debye
polarizability: 423.9876678|62.9784329|316.6608643|-31.8280069|35.706345|166.6455067 unknown
InChI: InChI=1S/C19H23Cl2N7/c1-3-28-6-4-5-12(10-28)23-17-7-11(2)22-18(26-17)27-19-24-15-8-13(20)14(21)9-16(15)25-19/h7-9,12,23-24,27H,3-6,10H2,1-2H3
charge 0 multiplicity 1
51 atoms
Cl -4.694885 -2.626451 -0.03057
Cl -6.511167 -0.114709 1.023375
N  0.792117 -2.994239 0.108895
N  3.417298 -0.377232 -0.751171
N  1.936022 1.259887 0.04693
N  2.711505 3.494874 0.677249
N  0.456389 2.935384 0.829447
N  -0.664939 0.833316 0.353461
N  -1.925402 2.603671 1.108924
C  2.332319 -1.352227 -0.974746
C  2.749952 -2.400177 -2.027296
C  1.924917 -2.063557 0.342072
C  1.608733 -3.425853 -2.211743
C  1.182638 -4.04756 -0.865998
C  0.296597 -3.547638 1.404407
C  -0.950511 -4.439959 1.274823
C  3.221842 0.899612 -0.272459
C  4.296357 1.826834 -0.118003
C  3.995546 3.119685 0.361915
C  1.750891 2.538228 0.500084
C  5.072028 4.164441 0.552398
C  -0.696758 2.160493 0.770114
C  -1.976467 0.359772 0.422913
C  -2.753348 1.47882 0.895701
C  -2.541194 -0.892967 0.133181
C  -4.145278 1.330829 1.077945
C  -3.931832 -1.014042 0.326479
C  -4.718322 0.076996 0.787754
H  1.449971 -0.803856 -1.354708
H  3.666697 -2.924637 -1.680645
H  2.989816 -1.905959 -2.987458
H  2.825942 -2.598024 0.746461
H  1.622534 -1.311158 1.092257
H  0.732955 -2.923651 -2.665264
H  1.926739 -4.228634 -2.902812
H  0.323493 -4.719173 -1.0297
H  2.025384 -4.6699 -0.460829
H  1.106858 -4.122172 1.924303
H  0.053569 -2.681986 2.049838
H  4.371303 -0.661672 -0.975568
H  -1.752987 -3.928299 0.715561
H  -0.732856 -5.399144 0.77273
H  -1.340107 -4.677753 2.281125
H  5.323891 1.549409 -0.369554
H  0.350708 3.89695 1.159304
H  5.576274 4.394759 -0.404168
H  4.624036 5.088536 0.947544
H  5.847475 3.813458 1.257765
H  0.235808 0.41363 0.067076
H  -1.936067 -1.734477 -0.216634
H  -4.760984 2.160121 1.433093
