program: Gaussian 09
title: 000285296
version: EM64L-G09RevD.01
frameworkgroup: C1[X(C12H20N2O3S)]
method: RPBEPBE
basis: SDD
operation: Freq
keyword: #p
keyword: freq=noraman
keyword: PBEPBE/SDD
title: #p freq=noraman PBEPBE/SDD
converged: YES YES NO NO
title: Mulliken charges:
elementType: S O O O N N C C C C C C C C C C C C H H H H H H H H H H H H H H H H H H H H
charge: 0.944078 -0.621248 -0.449851 -0.585933 -0.161609 -0.378628 -0.038529 0.462057 0.490742 -0.397284 -0.396787 -0.357654 -0.383754 -0.465379 -0.413709 -0.704976 -0.664086 -0.664469 0.236317 0.220638 0.218692 0.224231 0.218016 0.293605 0.225373 0.227238 0.214746 0.303737 0.221761 0.218369 0.267408 0.216941 0.238493 0.210699 0.214877 0.240632 0.211551 0.363696
chargesum: 0.00000
title: Mulliken charges with hydrogens summed into heavy atoms:
elementType: S O O O N N C C C C C C C C C C C C
charge: 0.944078 -0.257552 -0.449851 -0.585933 -0.161609 -0.085024 0.197789 0.462057 0.490742 0.042047 0.045460 -0.132281 -0.156517 -0.250633 -0.109972 0.002562 0.002048 0.002591
polarizability: 3.42990747e+02 -1.05778834e+01 1.90574505e+02 1.75479220e+00 -5.00718887e-01 1.15674559e+02
1716.lowfreq: -7.9814 -4.2694 -1.9860 0.0013 0.0021 0.0022 25.1946 33.3451 36.8120
frequency: 24.8768 33.2096 36.7928 57.5020 64.3933 78.0660 86.6948 108.5833 118.2852 133.1886 142.5437 181.7523 208.6828 211.2913 225.7404 230.3678 267.8507 278.5966 293.8100 308.7686 321.1250 354.4600 368.9516 384.5223 404.8727 418.0185 441.1925 468.8773 486.0897 509.3201 512.9284 534.1079 544.1823 555.9453 632.8992 653.6042 690.9021 717.7485 783.6050 786.3183 793.9030 818.7842 823.5753 877.1039 890.3481 916.2121 921.2497 947.5770 963.2850 992.7996 1015.0039 1037.5131 1045.1631 1071.5485 1077.2182 1095.3689 1112.4340 1142.8949 1160.5888 1200.2248 1208.2736 1230.2064 1264.7046 1272.7003 1290.0606 1311.3723 1328.3281 1337.6684 1345.2701 1353.5529 1378.3998 1382.4000 1385.5998 1395.7364 1400.8762 1437.0127 1462.3491 1464.7506 1466.8186 1476.6534 1480.9676 1482.4301 1492.6506 1499.1338 1506.9431 1527.5265 1579.6747 1642.2303 2979.8752 2980.3028 2981.2824 2987.2547 2988.0232 3030.2195 3036.4948 3046.3582 3075.2733 3076.1738 3086.9298 3089.3402 3091.3812 3104.6066 3109.6752 3133.1354 3160.3129 3164.7281 3465.6093 3535.4634
redmass: 5.0828 5.0292 6.1392 4.4333 3.2161 3.2821 6.4184 3.3843 4.2522 5.9701 3.1405 2.4041 1.1750 1.0362 2.3272 1.3603 4.8807 2.6545 3.1675 1.8407 2.5601 3.3512 4.1345 4.1711 3.9359 3.2770 3.3453 5.8076 3.6440 2.7968 3.7782 2.2762 2.2444 3.2337 6.4995 5.7874 3.6660 3.6459 1.2600 1.1303 1.4176 1.6335 2.7258 7.2844 2.3052 1.5769 1.8024 2.0377 1.3248 2.9139 2.9537 1.2321 1.4864 2.1321 1.8046 1.6445 2.3013 1.5660 1.9296 1.4828 2.3998 1.4643 1.4410 1.3968 1.2316 1.7763 1.5099 1.3934 1.3822 1.3370 2.5896 1.2342 1.2463 1.2881 2.1065 3.0705 1.0584 1.0462 1.0456 1.0572 1.0910 1.0488 1.0837 1.6346 1.1822 2.5552 4.7234 6.2335 1.0379 1.0364 1.0575 1.0369 1.0595 1.1028 1.1021 1.0877 1.0996 1.0994 1.0992 1.1010 1.1005 1.1004 1.0892 1.0908 1.0926 1.0934 1.0661 1.0759
irintensity: 0.1565 0.0917 1.5116 1.2351 0.6831 0.6802 2.6433 0.3746 3.7432 10.4144 2.8288 29.7816 0.0370 0.4339 5.8769 1.0419 8.5928 1.1195 11.2653 32.4470 6.6877 4.1497 1.2682 23.5447 25.9633 17.5258 18.7323 182.2432 64.1163 67.3146 5.8508 24.3583 13.4520 1.1505 30.0277 61.3767 4.4142 1.3019 22.6242 6.5384 28.1962 45.5791 18.4175 130.9503 0.3880 3.9494 3.0792 17.1158 1.0578 2.6169 37.4453 33.2532 25.4685 14.0001 28.3077 17.4577 4.5973 7.1918 25.9438 69.7831 41.3940 12.0293 170.0190 19.6265 5.0240 66.7208 2.9090 5.2056 27.1424 96.7819 17.7444 14.2513 37.2527 44.7470 38.2397 16.3730 10.1261 5.8372 9.2663 0.2144 13.1749 0.6745 29.0764 13.8527 38.9877 520.1137 5.8426 84.9261 40.5637 32.3221 49.2230 33.5637 55.3221 7.4410 20.3077 4.7827 38.7927 59.1855 27.6509 21.2148 75.1641 6.6305 22.6183 3.0068 21.4232 23.8762 29.8533 27.5637
temp: 298.150 k
press: 1.00000 atm
elementType: 16 8 8 8 7 7 6 6 6 6 6 6 6 6 6 6 6 6 1 1 1 1 1 1 1 1 1 1 1 1 1 1 1 1 1 1 1 1
symmnumber: 1
zpe: 808018.8 jmol-1
zpe.correction: 0.307758 hartree
zpe.thermalcorrener: 0.329074 hartree
zpe.thermalcorrenthalpy: 0.330018 hartree
zpe.thermalcorrgfe: 0.256298 hartree
zpe.sumelectzpe: -1201.003384 hartree
zpe.sumelectthermal: -1200.982068 hartree
zpe.sumelectthermalent: -1200.981124 hartree
zpe.sumelectthermalfe: -1201.054844 hartree
dipole: 3.6848 -0.8035 -0.9002
dipole: 3.8773
quadrupole: -112.8377 -102.9334 -118.5645
quadrupole: 4.9132 2.6667 -0.3277
quadrupole: -1.3925 8.5118 -7.1193 4.9132 2.6667 -0.3277
hfenergy: -1201.3111421 hartree
pointgroup: C01 [X(C12H20N2O3S1)]
dipole: 1.4095246 -0.082115 -0.5775351 debye
polarizability: 337.2860254|-26.6607302|149.5424786|-16.5842872|39.3600466|162.4113065 unknown
InChI: InChI=1S/C12H20N2O3S/c1-4-14(5-2)12-8-6-11(7-9-12)13-10(3)17-18(15)16/h6-10,13,15H,4-5H2,1-3H3
charge 0 multiplicity 1
38 atoms
S  -4.0579 0.60193 1.982652
O  -2.658717 1.878351 2.100974
O  -3.309613 -0.397586 0.663145
O  -5.28109 1.488899 1.384375
N  3.646123 -0.014581 0.221044
N  -1.865061 -0.444195 -1.241532
C  -2.935798 0.295315 -0.703794
C  2.286692 -0.122171 -0.124774
C  -0.503539 -0.333435 -0.834751
C  4.695957 -0.673201 -0.575795
C  4.081942 0.763478 1.394388
C  1.847165 -0.975695 -1.186114
C  1.272528 0.608645 0.571257
C  0.487336 -1.067624 -1.533334
C  -0.08998 0.498203 0.236906
C  -4.190933 0.284265 -1.575285
C  4.965533 -2.142429 -0.166268
C  4.289306 2.27056 1.104763
H  -2.617591 1.314958 -0.424792
H  4.433458 -0.620316 -1.649714
H  5.628245 -0.087553 -0.461409
H  3.354608 0.631817 2.217768
H  5.033162 0.328827 1.757171
H  -2.114145 -1.274183 -1.783355
H  2.563979 -1.582849 -1.746009
H  1.538563 1.274472 1.397018
H  0.194486 -1.725158 -2.36258
H  -0.824097 1.045046 0.838448
H  -3.988952 0.774548 -2.544822
H  -4.524847 -0.752968 -1.761498
H  -5.006101 0.820401 -1.062089
H  5.285335 -2.200788 0.889961
H  4.056343 -2.758535 -0.276879
H  5.764263 -2.582517 -0.792787
H  5.056829 2.416304 0.322918
H  3.354379 2.738815 0.751166
H  4.621695 2.801059 2.016978
H  -3.106166 2.767789 1.987146
